BDBM142822 US8940736, 328
SMILES: CCNc1nc(Nc2cc(cc(N3CC[C@H](NC(=O)OC)[C@@H](O)C3)c2Cl)C#N)nn2c(cnc12)[N+]#[C-]
InChI Key: InChIKey=RKAFZEOLMPAXTF-BBRMVZONSA-N
Data: 2 IC50
Activity Spreadsheet -- Enzyme Inhibition Constant Data from BindingDB
Found 2 hits for monomerid = 142822
Trg + Lig
Ki
nM
ΔG°
kcal/mole
IC50
nM
Kd
nM
EC50/IC50
nM
koff
s-1
kon
M-1s-1
pHTemp
°C
Casein kinase II subunit alpha'
(Homo sapiens (Human))
BDBM142822
(US8940736, 328)
Show SMILES CCNc1nc(Nc2cc(cc(N3CC[C@H](NC(=O)OC)[C@@H](O)C3)c2Cl)C#N)nn2c(cnc12)[N+]#[C-] |r|
Show InChI InChI=1S/C22H23ClN10O3/c1-4-26-19-20-27-10-17(25-2)33(20)31-21(30-19)28-14-7-12(9-24)8-15(18(14)23)32-6-5-13(16(34)11-32)29-22(35)36-3/h7-8,10,13,16,34H,4-6,11H2,1,3H3,(H,29,35)(H2,26,28,30,31)/t13-,16-/m0/s1
Reactome pathway
US Patent
n/an/a 0.130n/an/an/an/a7.430
Bristol-Myers Squibb Company
US Patent
Assay Description
The effectiveness of compounds of the present invention as inhibitors of protein kinases can be readily tested by assays known to those skilled in th...
US Patent US8940736 (2015)
BindingDB Entry DOI: 10.7270/Q2QV3K72
Casein kinase II subunit alpha
(Homo sapiens (Human))
BDBM142822
(US8940736, 328)
Show SMILES CCNc1nc(Nc2cc(cc(N3CC[C@H](NC(=O)OC)[C@@H](O)C3)c2Cl)C#N)nn2c(cnc12)[N+]#[C-] |r|
Show InChI InChI=1S/C22H23ClN10O3/c1-4-26-19-20-27-10-17(25-2)33(20)31-21(30-19)28-14-7-12(9-24)8-15(18(14)23)32-6-5-13(16(34)11-32)29-22(35)36-3/h7-8,10,13,16,34H,4-6,11H2,1,3H3,(H,29,35)(H2,26,28,30,31)/t13-,16-/m0/s1
US Patent
n/an/a 0.520n/an/an/an/a7.430
Bristol-Myers Squibb Company
US Patent
Assay Description
The effectiveness of compounds of the present invention as inhibitors of protein kinases can be readily tested by assays known to those skilled in th...
US Patent US8940736 (2015)
BindingDB Entry DOI: 10.7270/Q2QV3K72