BDBM143228 US8940748, 40ai::US9029362, 40ai::US9687494, 40ai
SMILES: COc1cnc(cn1)C(=O)Nc1ccc(F)c(c1)[C@]1(C)CS(=O)(=O)N(C)C(=N)N1
InChI Key: InChIKey=DJIXTIKKTNRBEW-KRWDZBQOSA-N
Data: 6 KI
Activity Spreadsheet -- Enzyme Inhibition Constant Data from BindingDB
Found 6 hits for monomerid = 143228
Trg + Lig
Ki
nM
ΔG°
kcal/mole
IC50
nM
Kd
nM
EC50/IC50
nM
koff
s-1
kon
M-1s-1
pHTemp
°C
Beta-secretase 1
(Homo sapiens (Human))
BDBM143228
(US8940748, 40ai | US9029362, 40ai | US9687494, 40a...)
Show SMILES COc1cnc(cn1)C(=O)Nc1ccc(F)c(c1)[C@]1(C)CS(=O)(=O)N(C)C(=N)N1 |r|
Show InChI InChI=1S/C17H19FN6O4S/c1-17(9-29(26,27)24(2)16(19)23-17)11-6-10(4-5-12(11)18)22-15(25)13-7-21-14(28-3)8-20-13/h4-8H,9H2,1-3H3,(H2,19,23)(H,22,25)/t17-/m0/s1
US Patent
1.64n/an/an/an/an/an/a5.01n/a
Merck Sharp & Dohme Corp.
US Patent
Assay Description
The protocol that was used to determine the recited values isdescribed as follows.BACE1 HTRF FRET AssayReagentsNa+-Acetate pH 5.01% Brij-35GlycerolDi...
US Patent US8940748 (2015)
BindingDB Entry DOI: 10.7270/Q2ZC81MM
Beta-secretase 1
(Homo sapiens (Human))
BDBM143228
(US8940748, 40ai | US9029362, 40ai | US9687494, 40a...)
Show SMILES COc1cnc(cn1)C(=O)Nc1ccc(F)c(c1)[C@]1(C)CS(=O)(=O)N(C)C(=N)N1 |r|
Show InChI InChI=1S/C17H19FN6O4S/c1-17(9-29(26,27)24(2)16(19)23-17)11-6-10(4-5-12(11)18)22-15(25)13-7-21-14(28-3)8-20-13/h4-8H,9H2,1-3H3,(H2,19,23)(H,22,25)/t17-/m0/s1
US Patent
1.64 -12.2n/an/an/an/an/a5.030
Merck Sharp & Dohme Corp.
US Patent
Assay Description
A homogeneous time-resolved FRET assay was used to determine IC50 values for inhibitors of the soluble human BACE1 catalytic domain. This assay monit...
US Patent US9029362 (2015)
BindingDB Entry DOI: 10.7270/Q2X63KP6
Beta-secretase 2
(Homo sapiens (Human))
BDBM143228
(US8940748, 40ai | US9029362, 40ai | US9687494, 40a...)
Show SMILES COc1cnc(cn1)C(=O)Nc1ccc(F)c(c1)[C@]1(C)CS(=O)(=O)N(C)C(=N)N1 |r|
Show InChI InChI=1S/C17H19FN6O4S/c1-17(9-29(26,27)24(2)16(19)23-17)11-6-10(4-5-12(11)18)22-15(25)13-7-21-14(28-3)8-20-13/h4-8H,9H2,1-3H3,(H2,19,23)(H,22,25)/t17-/m0/s1
US Patent
1.99 -12.1n/an/an/an/an/a5.030
Merck Sharp & Dohme Corp.
US Patent
Assay Description
Inhibitor IC50s at purified human autoBACE-2 were determined in a time-resolved endpoint proteolysis assay that measures hydrolysis of the QSY7-EISEV...
US Patent US9029362 (2015)
BindingDB Entry DOI: 10.7270/Q2X63KP6
Beta-secretase 2
(Homo sapiens (Human))
BDBM143228
(US8940748, 40ai | US9029362, 40ai | US9687494, 40a...)
Show SMILES COc1cnc(cn1)C(=O)Nc1ccc(F)c(c1)[C@]1(C)CS(=O)(=O)N(C)C(=N)N1 |r|
Show InChI InChI=1S/C17H19FN6O4S/c1-17(9-29(26,27)24(2)16(19)23-17)11-6-10(4-5-12(11)18)22-15(25)13-7-21-14(28-3)8-20-13/h4-8H,9H2,1-3H3,(H2,19,23)(H,22,25)/t17-/m0/s1
US Patent
1.99 -12.1n/an/an/an/an/a5.030
Merck Sharp & Dohme Corp.
US Patent
Assay Description
Inhibitor IC50s at purified human autoBACE-2 were determined in a time-resolved endpoint proteolysis assay that measures hydrolysis of the QSY7-EISEV...
US Patent US8940748 (2015)
BindingDB Entry DOI: 10.7270/Q2ZC81MM
Beta-secretase 1
(Homo sapiens (Human))
BDBM143228
(US8940748, 40ai | US9029362, 40ai | US9687494, 40a...)
Show SMILES COc1cnc(cn1)C(=O)Nc1ccc(F)c(c1)[C@]1(C)CS(=O)(=O)N(C)C(=N)N1 |r|
Show InChI InChI=1S/C17H19FN6O4S/c1-17(9-29(26,27)24(2)16(19)23-17)11-6-10(4-5-12(11)18)22-15(25)13-7-21-14(28-3)8-20-13/h4-8H,9H2,1-3H3,(H2,19,23)(H,22,25)/t17-/m0/s1
US Patent
1.64E+3n/an/an/an/an/an/a5.0n/a
Merck Sharp & Dohme Corp.
US Patent
Assay Description
This assay monitored the increase of 620 nm fluorescence that resulted from BACE1 cleavage of an APPswedish APPswe mutant peptide FRET substrate (QSY...
US Patent US9687494 (2017)
BindingDB Entry DOI: 10.7270/Q2CJ8BN7
Beta-secretase 2
(Homo sapiens (Human))
BDBM143228
(US8940748, 40ai | US9029362, 40ai | US9687494, 40a...)
Show SMILES COc1cnc(cn1)C(=O)Nc1ccc(F)c(c1)[C@]1(C)CS(=O)(=O)N(C)C(=N)N1 |r|
Show InChI InChI=1S/C17H19FN6O4S/c1-17(9-29(26,27)24(2)16(19)23-17)11-6-10(4-5-12(11)18)22-15(25)13-7-21-14(28-3)8-20-13/h4-8H,9H2,1-3H3,(H2,19,23)(H,22,25)/t17-/m0/s1
US Patent
1.99E+3n/an/an/an/an/an/a5.0n/a
Merck Sharp & Dohme Corp.
US Patent
Assay Description
This assay monitored the increase of 620 nm fluorescence that resulted from BACE1 cleavage of an APPswedish APPswe mutant peptide FRET substrate (QSY...
US Patent US9687494 (2017)
BindingDB Entry DOI: 10.7270/Q2CJ8BN7