BDBM143546 US8969341, 141
SMILES: COc1ccccc1-n1nc2C(=O)N([C@H](c2c1C(C)C)c1ccc(Cl)cc1C)c1cc(Cl)ccc1C
InChI Key: InChIKey=ZPZFPPPXKLFRBC-NDEPHWFRSA-N
Data: 4 IC50
Activity Spreadsheet -- Enzyme Inhibition Constant Data from BindingDB
Found 4 hits for monomerid = 143546
Trg + Lig
Ki
nM
ΔG°
kcal/mole
IC50
nM
Kd
nM
EC50/IC50
nM
koff
s-1
kon
M-1s-1
pHTemp
°C
MDM2-MDMX
(Homo sapiens (Human))
BDBM143546
(US8969341, 141)
Show SMILES COc1ccccc1-n1nc2C(=O)N([C@H](c2c1C(C)C)c1ccc(Cl)cc1C)c1cc(Cl)ccc1C |r|
Show InChI InChI=1S/C29H27Cl2N3O2/c1-16(2)27-25-26(32-34(27)22-8-6-7-9-24(22)36-5)29(35)33(23-15-20(31)11-10-17(23)3)28(25)21-13-12-19(30)14-18(21)4/h6-16,28H,1-5H3/t28-/m0/s1
NCI pathway
Reactome pathway
US Patent
n/an/a 0.600n/an/an/an/an/an/a
Novartis AG
US Patent
Assay Description
The inhibition of p53-MDM2 and p53-MDM4 interactions is measured by time resolved fluorescence energy transfer (TR-FRET). Fluorescence energy transfe...
US Patent US8969341 (2015)
BindingDB Entry DOI: 10.7270/Q2K35SC8
MDM2-MDMX
(Homo sapiens (Human))
BDBM143546
(US8969341, 141)
Show SMILES COc1ccccc1-n1nc2C(=O)N([C@H](c2c1C(C)C)c1ccc(Cl)cc1C)c1cc(Cl)ccc1C |r|
Show InChI InChI=1S/C29H27Cl2N3O2/c1-16(2)27-25-26(32-34(27)22-8-6-7-9-24(22)36-5)29(35)33(23-15-20(31)11-10-17(23)3)28(25)21-13-12-19(30)14-18(21)4/h6-16,28H,1-5H3/t28-/m0/s1
NCI pathway
Reactome pathway
n/an/a 0.130n/an/an/an/an/an/a
Novartis Institutes for BioMedical Research
Curated by ChEMBL
Assay Description
Inhibition of Cy5-labeled p53 derived TFSDLWKLL peptide binding to C-terminal biotin-labelled human MDM2 (2 to 188 residues) by TR-FRET assay
Bioorg Med Chem Lett 28: 3404-3408 (2018)
Article DOI: 10.1016/j.bmcl.2018.08.027
BindingDB Entry DOI: 10.7270/Q2C82D0H
MDM2-MDMX
(Homo sapiens (Human))
BDBM143546
(US8969341, 141)
Show SMILES COc1ccccc1-n1nc2C(=O)N([C@H](c2c1C(C)C)c1ccc(Cl)cc1C)c1cc(Cl)ccc1C |r|
Show InChI InChI=1S/C29H27Cl2N3O2/c1-16(2)27-25-26(32-34(27)22-8-6-7-9-24(22)36-5)29(35)33(23-15-20(31)11-10-17(23)3)28(25)21-13-12-19(30)14-18(21)4/h6-16,28H,1-5H3/t28-/m0/s1
NCI pathway
Reactome pathway
US Patent
n/an/a 0.161n/an/an/an/an/an/a
Novartis AG
US Patent
Assay Description
The inhibition of p53-MDM2 and p53-MDM4 interactions is measured by time resolved fluorescence energy transfer (TR-FRET). Fluorescence energy transfe...
US Patent US8969341 (2015)
BindingDB Entry DOI: 10.7270/Q2K35SC8
p53-Binding Protein HDMX
(Homo sapiens (Human))
BDBM143546
(US8969341, 141)
Show SMILES COc1ccccc1-n1nc2C(=O)N([C@H](c2c1C(C)C)c1ccc(Cl)cc1C)c1cc(Cl)ccc1C |r|
Show InChI InChI=1S/C29H27Cl2N3O2/c1-16(2)27-25-26(32-34(27)22-8-6-7-9-24(22)36-5)29(35)33(23-15-20(31)11-10-17(23)3)28(25)21-13-12-19(30)14-18(21)4/h6-16,28H,1-5H3/t28-/m0/s1
NCI pathway
US Patent
n/an/a 700n/an/an/an/an/an/a
Novartis AG
US Patent
Assay Description
The inhibition of p53-MDM2 and p53-MDM4 interactions is measured by time resolved fluorescence energy transfer (TR-FRET). Fluorescence energy transfe...
US Patent US8969341 (2015)
BindingDB Entry DOI: 10.7270/Q2K35SC8