BDBM143563 US9682955, 57
SMILES: NC(=O)c1cccc(CNc2ncnc3ccc(cc23)C(c2ccc(Cl)cc2)c2ccc(Cl)cc2)c1
InChI Key: InChIKey=PCXZWAUSVDAFII-UHFFFAOYSA-N
Data: 2 EC50
Activity Spreadsheet -- Enzyme Inhibition Constant Data from BindingDB
Found 2 hits for monomerid = 143563
Trg + Lig
Ki
nM
ΔG°
kcal/mole
IC50
nM
Kd
nM
EC50/IC50
nM
koff
s-1
kon
M-1s-1
pHTemp
°C
Cannabinoid receptor 2
(Homo sapiens (Human))
BDBM143563
(US9682955, 57)
Show SMILES NC(=O)c1cccc(CNc2ncnc3ccc(cc23)C(c2ccc(Cl)cc2)c2ccc(Cl)cc2)c1
Show InChI InChI=1S/C29H22Cl2N4O/c30-23-9-4-19(5-10-23)27(20-6-11-24(31)12-7-20)21-8-13-26-25(15-21)29(35-17-34-26)33-16-18-2-1-3-22(14-18)28(32)36/h1-15,17,27H,16H2,(H2,32,36)(H,33,34,35)
Reactome pathway
US Patent
n/an/an/an/a 4.95E+3n/an/an/a27
Janssen Pharmaceutica NV
US Patent
Assay Description
The following mixtures and buffer solutions were prepared: (a) Buffer 1: HBSS (Mediatech Cat#21-023-CV) with 5 mM HEPES (1 mM stock, Gibco BRL Cat#15...
US Patent US9682955 (2017)
BindingDB Entry DOI: 10.7270/Q2707ZM3
Cannabinoid receptor 1
(Homo sapiens (Human))
BDBM143563
(US9682955, 57)
Show SMILES NC(=O)c1cccc(CNc2ncnc3ccc(cc23)C(c2ccc(Cl)cc2)c2ccc(Cl)cc2)c1
Show InChI InChI=1S/C29H22Cl2N4O/c30-23-9-4-19(5-10-23)27(20-6-11-24(31)12-7-20)21-8-13-26-25(15-21)29(35-17-34-26)33-16-18-2-1-3-22(14-18)28(32)36/h1-15,17,27H,16H2,(H2,32,36)(H,33,34,35)
NCI pathway
Reactome pathway
US Patent
n/an/an/an/a 215n/an/an/a27
Janssen Pharmaceutica NV
US Patent
Assay Description
The following mixtures and buffer solutions were prepared: (a) Buffer 1: HBSS (Mediatech Cat#21-023-CV) with 5 mM HEPES (1 mM stock, Gibco BRL Cat#15...
US Patent US9682955 (2017)
BindingDB Entry DOI: 10.7270/Q2707ZM3