BDBM143602 US8969341, 157
SMILES: COc1nc(ncc1-n1nc2C(=O)N(C(c2c1C(C)C)c1ccc(cc1)C#N)c1cc(Cl)c[nH]c1=O)N(C)C
InChI Key:
Data: 1 IC50
PDB links: 2 PDB IDs match this monomer.
Activity Spreadsheet -- Enzyme Inhibition Constant Data from BindingDB
Found 1 hit for monomerid = 143602
Trg + Lig
Ki
nM
ΔG°
kcal/mole
IC50
nM
Kd
nM
EC50/IC50
nM
koff
s-1
kon
M-1s-1
pHTemp
°C
MDM2-MDMX
(Homo sapiens (Human))
BDBM143602
(US8969341, 157)
Show SMILES COc1nc(ncc1-n1nc2C(=O)N(C(c2c1C(C)C)c1ccc(cc1)C#N)c1cc(Cl)c[nH]c1=O)N(C)C
NCI pathway
Reactome pathway
US Patent
n/an/a 0.166n/an/an/an/an/an/a
Novartis AG
US Patent
Assay Description
The inhibition of p53-MDM2 and p53-MDM4 interactions is measured by time resolved fluorescence energy transfer (TR-FRET). Fluorescence energy transfe...
US Patent US8969341 (2015)
BindingDB Entry DOI: 10.7270/Q2K35SC8
3D
3D Structure (crystal)