BDBM143653 US8969341, 172
SMILES: CNc1ncc(c(OC)n1)-n1nc2C(=O)N(C(c2c1C(C)C)c1ccc(Cl)cc1)c1cc(Cl)c(=O)n(C)c1
InChI Key: InChIKey=JFMPRDLNBMLXEF-UHFFFAOYSA-N
Data: 1 IC50
Activity Spreadsheet -- Enzyme Inhibition Constant Data from BindingDB
Found 1 hit for monomerid = 143653
Trg + Lig
Ki
nM
ΔG°
kcal/mole
IC50
nM
Kd
nM
EC50/IC50
nM
koff
s-1
kon
M-1s-1
pHTemp
°C
MDM2-MDMX
(Homo sapiens (Human))
BDBM143653
(US8969341, 172)
Show SMILES CNc1ncc(c(OC)n1)-n1nc2C(=O)N(C(c2c1C(C)C)c1ccc(Cl)cc1)c1cc(Cl)c(=O)n(C)c1
Show InChI InChI=1S/C26H25Cl2N7O3/c1-13(2)21-19-20(32-35(21)18-11-30-26(29-3)31-23(18)38-5)25(37)34(16-10-17(28)24(36)33(4)12-16)22(19)14-6-8-15(27)9-7-14/h6-13,22H,1-5H3,(H,29,30,31)
NCI pathway
Reactome pathway
US Patent
n/an/a 0.371n/an/an/an/an/an/a
Novartis AG
US Patent
Assay Description
The inhibition of p53-MDM2 and p53-MDM4 interactions is measured by time resolved fluorescence energy transfer (TR-FRET). Fluorescence energy transfe...
US Patent US8969341 (2015)
BindingDB Entry DOI: 10.7270/Q2K35SC8