BDBM143671 US8969341, 178
SMILES: COc1nc(ncc1-n1nc2C(=O)N([C@H](c2c1C(C)C)c1ccc(cc1)C#N)c1cc(Cl)c(=O)n(C)c1)N(C)C
InChI Key: InChIKey=RQRGUXOSYRMAOC-DEOSSOPVSA-N
Data: 1 IC50
Activity Spreadsheet -- Enzyme Inhibition Constant Data from BindingDB
Found 1 hit for monomerid = 143671
Trg + Lig
Ki
nM
ΔG°
kcal/mole
IC50
nM
Kd
nM
EC50/IC50
nM
koff
s-1
kon
M-1s-1
pHTemp
°C
MDM2-MDMX
(Homo sapiens (Human))
BDBM143671
(US8969341, 178)
Show SMILES COc1nc(ncc1-n1nc2C(=O)N([C@H](c2c1C(C)C)c1ccc(cc1)C#N)c1cc(Cl)c(=O)n(C)c1)N(C)C |r|
Show InChI InChI=1S/C28H27ClN8O3/c1-15(2)23-21-22(33-37(23)20-13-31-28(34(3)4)32-25(20)40-6)27(39)36(18-11-19(29)26(38)35(5)14-18)24(21)17-9-7-16(12-30)8-10-17/h7-11,13-15,24H,1-6H3/t24-/m0/s1
NCI pathway
Reactome pathway
US Patent
n/an/a 0.120n/an/an/an/an/an/a
Novartis AG
US Patent
Assay Description
The inhibition of p53-MDM2 and p53-MDM4 interactions is measured by time resolved fluorescence energy transfer (TR-FRET). Fluorescence energy transfe...
US Patent US8969341 (2015)
BindingDB Entry DOI: 10.7270/Q2K35SC8