BDBM143715 US8969341, 194
SMILES: COc1nc(ncc1-n1nc2C(=O)N(C(c2c1C(C)C)c1ccc(C#N)c(F)c1)c1c[nH]c(=O)c(Cl)c1)N(C)C
InChI Key:
Data: 1 IC50
Activity Spreadsheet -- Enzyme Inhibition Constant Data from BindingDB
Found 1 hit for monomerid = 143715
Trg + Lig
Ki
nM
ΔG°
kcal/mole
IC50
nM
Kd
nM
EC50/IC50
nM
koff
s-1
kon
M-1s-1
pHTemp
°C
MDM2-MDMX
(Homo sapiens (Human))
BDBM143715
(US8969341, 194)
Show SMILES COc1nc(ncc1-n1nc2C(=O)N(C(c2c1C(C)C)c1ccc(C#N)c(F)c1)c1c[nH]c(=O)c(Cl)c1)N(C)C
NCI pathway
Reactome pathway
US Patent
n/an/a 0.197n/an/an/an/an/an/a
Novartis AG
US Patent
Assay Description
The inhibition of p53-MDM2 and p53-MDM4 interactions is measured by time resolved fluorescence energy transfer (TR-FRET). Fluorescence energy transfe...
US Patent US8969341 (2015)
BindingDB Entry DOI: 10.7270/Q2K35SC8