BDBM143829 US8969325, 30
SMILES: C[C@@]1(C[C@@H](NC(=O)Nc2ccc3CCC(=O)Nc3c2)c2ccc(Cl)cc2O1)C(F)F
InChI Key: InChIKey=QQZDIHDOETVORL-IIBYNOLFSA-N
Data: 1 IC50
Activity Spreadsheet -- Enzyme Inhibition Constant Data from BindingDB
Found 1 hit for monomerid = 143829
Trg + Lig
Ki
nM
ΔG°
kcal/mole
IC50
nM
Kd
nM
EC50/IC50
nM
koff
s-1
kon
M-1s-1
pHTemp
°C
Transient receptor potential cation channel subfamily V member 1
(Homo sapiens (Human))
BDBM143829
(US8969325, 30)
Show SMILES C[C@@]1(C[C@@H](NC(=O)Nc2ccc3CCC(=O)Nc3c2)c2ccc(Cl)cc2O1)C(F)F
Show InChI InChI=1S/C21H20ClF2N3O3/c1-21(19(23)24)10-16(14-6-4-12(22)8-17(14)30-21)27-20(29)25-13-5-2-11-3-7-18(28)26-15(11)9-13/h2,4-6,8-9,16,19H,3,7,10H2,1H3,(H,26,28)(H2,25,27,29)/t16-,21-/m1/s1
Reactome pathway
US Patent
n/an/a 4n/an/an/an/an/an/a
AbbVie Inc.
US Patent
Assay Description
The cDNA for human TRPV1 (hTRPV1) was isolated by reverse transcriptase-polymerase chain reaction (RT-PCR) from human small intestine poly A+ RNA sup...
US Patent US8969325 (2015)
BindingDB Entry DOI: 10.7270/Q29P30BX