BDBM143933 US8969325, 134
SMILES: C[C@H]1Oc2c(NC(=O)N[C@@H]3CC(CF)(CF)Oc4cc(Cl)ccc34)cccc2NC1=O
InChI Key: InChIKey=QUIXEVQCRWMFKR-BDJLRTHQSA-N
Data: 1 IC50
Activity Spreadsheet -- Enzyme Inhibition Constant Data from BindingDB
Found 1 hit for monomerid = 143933
Trg + Lig
Ki
nM
ΔG°
kcal/mole
IC50
nM
Kd
nM
EC50/IC50
nM
koff
s-1
kon
M-1s-1
pHTemp
°C
Transient receptor potential cation channel subfamily V member 1
(Homo sapiens (Human))
BDBM143933
(US8969325, 134)
Show SMILES C[C@H]1Oc2c(NC(=O)N[C@@H]3CC(CF)(CF)Oc4cc(Cl)ccc34)cccc2NC1=O
Show InChI InChI=1S/C21H20ClF2N3O4/c1-11-19(28)25-14-3-2-4-15(18(14)30-11)26-20(29)27-16-8-21(9-23,10-24)31-17-7-12(22)5-6-13(16)17/h2-7,11,16H,8-10H2,1H3,(H,25,28)(H2,26,27,29)/t11-,16-/m1/s1
Reactome pathway
US Patent
n/an/a 8n/an/an/an/an/an/a
AbbVie Inc.
US Patent
Assay Description
The cDNA for human TRPV1 (hTRPV1) was isolated by reverse transcriptase-polymerase chain reaction (RT-PCR) from human small intestine poly A+ RNA sup...
US Patent US8969325 (2015)
BindingDB Entry DOI: 10.7270/Q29P30BX