null
SMILES: ClCC(=N)NCCC[C@H](NC(=O)c1ccccc1)C(=O)NCc1ccccc1
InChI Key: InChIKey=UKLOIMAWYDJJGH-SFHVURJKSA-N
Activity Spreadsheet -- Enzyme Inhibition Constant Data from BindingDB
Found 1 hit for monomerid = 144274
Trg + Lig
Ki
nM
ΔG°
kcal/mole
IC50
nM
Kd
nM
EC50/IC50
nM
koff
s-1
kon
M-1s-1
pHTemp
°C
Protein-arginine deiminase type-6
(Homo sapiens (Human))
BDBM144274
(US8969333, BL1-07)
Show SMILES ClCC(=N)NCCC[C@H](NC(=O)c1ccccc1)C(=O)NCc1ccccc1 |r|
Show InChI InChI=1S/C21H25ClN4O2/c22-14-19(23)24-13-7-12-18(26-20(27)17-10-5-2-6-11-17)21(28)25-15-16-8-3-1-4-9-16/h1-6,8-11,18H,7,12-15H2,(H2,23,24)(H,25,28)(H,26,27)/t18-/m0/s1
US Patent
n/an/a>2.00E+4n/an/an/an/an/a37
The Penn State Research Foundation
US Patent
Assay Description
The inhibition efficacy of PAD4 inhibitors were determined by colorimetric measurement of citrulline generated by PAD4 catalyzed citrullination of BA...
US Patent US8969333 (2015)
BindingDB Entry DOI: 10.7270/Q2SN07P5