BDBM144318 US8969336, 553::US8969336, 580
SMILES: COc1cc(Nc2nc(NC3CCOCC3)c(nc2C(N)=O)C(C)C)ccc1N1CCN(C)CC1
InChI Key: InChIKey=XNHPFRKBDONKHT-UHFFFAOYSA-N
Data: 4 IC50
Activity Spreadsheet -- Enzyme Inhibition Constant Data from BindingDB
Found 4 hits for monomerid = 144318
Trg + Lig
Ki
nM
ΔG°
kcal/mole
IC50
nM
Kd
nM
EC50/IC50
nM
koff
s-1
kon
M-1s-1
pHTemp
°C
Tyrosine-protein kinase receptor
(Homo sapiens (Human))
BDBM144318
(US8969336, 553 | US8969336, 580)
Show SMILES COc1cc(Nc2nc(NC3CCOCC3)c(nc2C(N)=O)C(C)C)ccc1N1CCN(C)CC1
Show InChI InChI=1S/C25H37N7O3/c1-16(2)21-24(27-17-7-13-35-14-8-17)30-25(22(29-21)23(26)33)28-18-5-6-19(20(15-18)34-4)32-11-9-31(3)10-12-32/h5-6,15-17H,7-14H2,1-4H3,(H2,26,33)(H2,27,28,30)
US Patent
n/an/a 1.40n/an/an/an/an/an/a
Astellas Pharma Inc.; Kotobuki Pharmaceutical Co., Ltd.
US Patent
Assay Description
A recombinant retrovirus was created from expression plasmid FLAG-EML4-ALKv1/pMX-iresCD8 in which cDNA for EMLA-ALK fusion protein v1 was integrated,...
US Patent US8969336 (2015)
BindingDB Entry DOI: 10.7270/Q2NV9GZW
Receptor-type tyrosine-protein kinase FLT3
(Homo sapiens (Human))
BDBM144318
(US8969336, 553 | US8969336, 580)
Show SMILES COc1cc(Nc2nc(NC3CCOCC3)c(nc2C(N)=O)C(C)C)ccc1N1CCN(C)CC1
Show InChI InChI=1S/C25H37N7O3/c1-16(2)21-24(27-17-7-13-35-14-8-17)30-25(22(29-21)23(26)33)28-18-5-6-19(20(15-18)34-4)32-11-9-31(3)10-12-32/h5-6,15-17H,7-14H2,1-4H3,(H2,26,33)(H2,27,28,30)
US Patent
n/an/a 0.490n/an/an/an/an/an/a
Astellas Pharma Inc.; Kotobuki Pharmaceutical Co., Ltd.
US Patent
Assay Description
A partial protein of only a kinase domain of FLT3 protein was purchased from Carna Biosciences Inc., Japan, and tests were conducted as in Test Examp...
US Patent US8969336 (2015)
BindingDB Entry DOI: 10.7270/Q2NV9GZW
Proto-oncogene tyrosine-protein kinase ROS
(Homo sapiens (Human))
BDBM144318
(US8969336, 553 | US8969336, 580)
Show SMILES COc1cc(Nc2nc(NC3CCOCC3)c(nc2C(N)=O)C(C)C)ccc1N1CCN(C)CC1
Show InChI InChI=1S/C25H37N7O3/c1-16(2)21-24(27-17-7-13-35-14-8-17)30-25(22(29-21)23(26)33)28-18-5-6-19(20(15-18)34-4)32-11-9-31(3)10-12-32/h5-6,15-17H,7-14H2,1-4H3,(H2,26,33)(H2,27,28,30)
US Patent
n/an/a 0.290n/an/an/an/an/an/a
Astellas Pharma Inc.; Kotobuki Pharmaceutical Co., Ltd.
US Patent
Assay Description
A partial protein of only a kinase domain of ROS protein was purchased from Carna Biosciences Inc., Japan, and tests were conducted as in Test Exampl...
US Patent US8969336 (2015)
BindingDB Entry DOI: 10.7270/Q2NV9GZW
Proto-oncogene tyrosine-protein kinase receptor Ret
(Homo sapiens (Human))
BDBM144318
(US8969336, 553 | US8969336, 580)
Show SMILES COc1cc(Nc2nc(NC3CCOCC3)c(nc2C(N)=O)C(C)C)ccc1N1CCN(C)CC1
Show InChI InChI=1S/C25H37N7O3/c1-16(2)21-24(27-17-7-13-35-14-8-17)30-25(22(29-21)23(26)33)28-18-5-6-19(20(15-18)34-4)32-11-9-31(3)10-12-32/h5-6,15-17H,7-14H2,1-4H3,(H2,26,33)(H2,27,28,30)
US Patent
n/an/a 3.60n/an/an/an/an/an/a
Astellas Pharma Inc.; Kotobuki Pharmaceutical Co., Ltd.
US Patent
Assay Description
A partial protein of only a kinase domain of RET protein was purchased from Carna Biosciences Inc., Japan. The phosphorylation activity toward a pept...
US Patent US8969336 (2015)
BindingDB Entry DOI: 10.7270/Q2NV9GZW