BDBM144459 US8969568, 10
SMILES: COc1cc(ccc1OC1CCS(=O)(=O)CC1)-c1cc2ncccc2c(OC[C@H]2CNC(=O)C2)n1
InChI Key: InChIKey=HXOQXFCONGPGSC-MRXNPFEDSA-N
Data: 1 IC50
Activity Spreadsheet -- Enzyme Inhibition Constant Data from BindingDB
Found 1 hit for monomerid = 144459
Trg + Lig
Ki
nM
ΔG°
kcal/mole
IC50
nM
Kd
nM
EC50/IC50
nM
koff
s-1
kon
M-1s-1
pHTemp
°C
Tyrosine-protein kinase SYK
(Homo sapiens (Human))
BDBM144459
(US8969568, 10)
Show SMILES COc1cc(ccc1OC1CCS(=O)(=O)CC1)-c1cc2ncccc2c(OC[C@H]2CNC(=O)C2)n1 |r|
Show InChI InChI=1S/C25H27N3O6S/c1-32-23-12-17(4-5-22(23)34-18-6-9-35(30,31)10-7-18)20-13-21-19(3-2-8-26-21)25(28-20)33-15-16-11-24(29)27-14-16/h2-5,8,12-13,16,18H,6-7,9-11,14-15H2,1H3,(H,27,29)/t16-/m1/s1
NCI pathway
Reactome pathway
US Patent
n/an/a 1n/an/an/an/an/an/a
Boehringer Ingelheim Pharma GmbH & Co. KG
US Patent
Assay Description
Recombinant human Syk (amino acids 342-635) was expressed as a fusion protein with an N-terminal GST tag, affinity-purified and deep-frozen at a conc...
US Patent US8969568 (2015)
BindingDB Entry DOI: 10.7270/Q2154FRD