BDBM144470 US8969568, 21
SMILES: COc1cc(cc2OCOc12)-c1cc2ncccc2c(O[C@H](C)[C@H]2CNC(=O)C2)n1
InChI Key: InChIKey=IOHBEJVDQBRYNR-TZMCWYRMSA-N
Data: 1 IC50
Activity Spreadsheet -- Enzyme Inhibition Constant Data from BindingDB
Found 1 hit for monomerid = 144470
Trg + Lig
Ki
nM
ΔG°
kcal/mole
IC50
nM
Kd
nM
EC50/IC50
nM
koff
s-1
kon
M-1s-1
pHTemp
°C
Tyrosine-protein kinase SYK
(Homo sapiens (Human))
BDBM144470
(US8969568, 21)
Show SMILES COc1cc(cc2OCOc12)-c1cc2ncccc2c(O[C@H](C)[C@H]2CNC(=O)C2)n1 |r|
Show InChI InChI=1S/C22H21N3O5/c1-12(14-8-20(26)24-10-14)30-22-15-4-3-5-23-17(15)9-16(25-22)13-6-18(27-2)21-19(7-13)28-11-29-21/h3-7,9,12,14H,8,10-11H2,1-2H3,(H,24,26)/t12-,14-/m1/s1
NCI pathway
Reactome pathway
US Patent
n/an/a 0.700n/an/an/an/an/an/a
Boehringer Ingelheim Pharma GmbH & Co. KG
US Patent
Assay Description
Recombinant human Syk (amino acids 342-635) was expressed as a fusion protein with an N-terminal GST tag, affinity-purified and deep-frozen at a conc...
US Patent US8969568 (2015)
BindingDB Entry DOI: 10.7270/Q2154FRD