BDBM144575 US8969578, 7
SMILES: OC(=O)c1nc(oc1Cc1ccc(OP(O)(O)=O)cc1)-c1ccccc1
InChI Key: InChIKey=RWSUXWBLNYBURS-UHFFFAOYSA-N
Data: 1 IC50
Activity Spreadsheet -- Enzyme Inhibition Constant Data from BindingDB
Found 1 hit for monomerid = 144575
Trg + Lig
Ki
nM
ΔG°
kcal/mole
IC50
nM
Kd
nM
EC50/IC50
nM
koff
s-1
kon
M-1s-1
pHTemp
°C
Signal transducer and activator of transcription 3
(Homo sapiens (Human))
BDBM144575
(US8969578, 7)
Show SMILES OC(=O)c1nc(oc1Cc1ccc(OP(O)(O)=O)cc1)-c1ccccc1
Show InChI InChI=1S/C17H14NO7P/c19-17(20)15-14(24-16(18-15)12-4-2-1-3-5-12)10-11-6-8-13(9-7-11)25-26(21,22)23/h1-9H,10H2,(H,19,20)(H2,21,22,23)
US Patent
n/an/a>1.00E+6n/an/an/an/an/an/a
University of Central Florida Research Foundation, Inc.
US Patent
Assay Description
A screening process evaluated in vitro disruption of STAT3(dimer)-DNA formation through a previously published EMSA based assays, giving a valuable i...
US Patent US8969578 (2015)
BindingDB Entry DOI: 10.7270/Q2WD3Z84