BDBM145152 US8952157, 343::US9303025, 343
SMILES: CN1CCN(CC1)Nc1ccc(cc1[N+]([O-])=O)S(=O)(=O)NC(=O)c1ccc(cc1Oc1cnc(N)c(Cl)c1)N1CCN(CC2=C(CC(C)(C)CC2)c2ccc(Cl)cc2)CC1
InChI Key: InChIKey=RMDOWIWJHKVVQV-UHFFFAOYSA-N
Data: 2 KI
Activity Spreadsheet -- Enzyme Inhibition Constant Data from BindingDB
Found 2 hits for monomerid = 145152
Trg + Lig
Ki
nM
ΔG°
kcal/mole
IC50
nM
Kd
nM
EC50/IC50
nM
koff
s-1
kon
M-1s-1
pHTemp
°C
Apoptosis regulator Bcl-2
(Homo sapiens (Human))
BDBM145152
(US8952157, 343 | US9303025, 343)
Show SMILES CN1CCN(CC1)Nc1ccc(cc1[N+]([O-])=O)S(=O)(=O)NC(=O)c1ccc(cc1Oc1cnc(N)c(Cl)c1)N1CCN(CC2=C(CC(C)(C)CC2)c2ccc(Cl)cc2)CC1 |t:47|
Show InChI InChI=1S/C42H49Cl2N9O6S/c1-42(2)13-12-29(35(25-42)28-4-6-30(43)7-5-28)27-50-16-18-51(19-17-50)31-8-10-34(39(22-31)59-32-23-36(44)40(45)46-26-32)41(54)48-60(57,58)33-9-11-37(38(24-33)53(55)56)47-52-20-14-49(3)15-21-52/h4-11,22-24,26,47H,12-21,25,27H2,1-3H3,(H2,45,46)(H,48,54)
US Patent
0.00900 -15.1n/an/an/an/an/an/a25
AbbVie Inc.
US Patent
Assay Description
Representative compounds were serially diluted in dimethyl sulfoxide (DMSO) starting at 50 μM (2× starting concentration; 10% DMSO) and 10 μ...
US Patent US9303025 (2016)
BindingDB Entry DOI: 10.7270/Q2XD10JP
Apoptosis regulator Bcl-2
(Homo sapiens (Human))
BDBM145152
(US8952157, 343 | US9303025, 343)
Show SMILES CN1CCN(CC1)Nc1ccc(cc1[N+]([O-])=O)S(=O)(=O)NC(=O)c1ccc(cc1Oc1cnc(N)c(Cl)c1)N1CCN(CC2=C(CC(C)(C)CC2)c2ccc(Cl)cc2)CC1 |t:47|
Show InChI InChI=1S/C42H49Cl2N9O6S/c1-42(2)13-12-29(35(25-42)28-4-6-30(43)7-5-28)27-50-16-18-51(19-17-50)31-8-10-34(39(22-31)59-32-23-36(44)40(45)46-26-32)41(54)48-60(57,58)33-9-11-37(38(24-33)53(55)56)47-52-20-14-49(3)15-21-52/h4-11,22-24,26,47H,12-21,25,27H2,1-3H3,(H2,45,46)(H,48,54)
US Patent
0.00900 -15.1n/an/an/an/an/an/a25
AbbVie Inc.; The Walter and Eliza Hall Institute of Medical Research
US Patent
Assay Description
Representative compounds were serially diluted in dimethyl sulfoxide (DMSO) starting at 50 uM (2x starting concentration; 10% DMSO) and 10 uL were tr...
US Patent US8952157 (2015)
BindingDB Entry DOI: 10.7270/Q2QN65G9