BDBM145159 US8952157, 350::US9303025, 350
SMILES: CC1(C)CCC(CN2CCN(CC2)c2ccc(C(=O)NS(=O)(=O)c3ccc(NCC4CCOCC4)c(c3)[N+]([O-])=O)c(Oc3cnc(N)c(Br)c3)c2)=C(C1)c1ccc(Cl)cc1
InChI Key: InChIKey=ICIBWBLPRJXKRK-UHFFFAOYSA-N
Data: 2 KI
Activity Spreadsheet -- Enzyme Inhibition Constant Data from BindingDB
Found 2 hits for monomerid = 145159
Trg + Lig
Ki
nM
ΔG°
kcal/mole
IC50
nM
Kd
nM
EC50/IC50
nM
koff
s-1
kon
M-1s-1
pHTemp
°C
Apoptosis regulator Bcl-2
(Homo sapiens (Human))
BDBM145159
(US8952157, 350 | US9303025, 350)
Show SMILES CC1(C)CCC(CN2CCN(CC2)c2ccc(C(=O)NS(=O)(=O)c3ccc(NCC4CCOCC4)c(c3)[N+]([O-])=O)c(Oc3cnc(N)c(Br)c3)c2)=C(C1)c1ccc(Cl)cc1 |c:55|
Show InChI InChI=1S/C43H49BrClN7O7S/c1-43(2)14-11-30(36(24-43)29-3-5-31(45)6-4-29)27-50-15-17-51(18-16-50)32-7-9-35(40(21-32)59-33-22-37(44)41(46)48-26-33)42(53)49-60(56,57)34-8-10-38(39(23-34)52(54)55)47-25-28-12-19-58-20-13-28/h3-10,21-23,26,28,47H,11-20,24-25,27H2,1-2H3,(H2,46,48)(H,49,53)
US Patent
<0.0100<-15.0n/an/an/an/an/an/a25
AbbVie Inc.
US Patent
Assay Description
Representative compounds were serially diluted in dimethyl sulfoxide (DMSO) starting at 50 μM (2× starting concentration; 10% DMSO) and 10 μ...
US Patent US9303025 (2016)
BindingDB Entry DOI: 10.7270/Q2XD10JP
Apoptosis regulator Bcl-2
(Homo sapiens (Human))
BDBM145159
(US8952157, 350 | US9303025, 350)
Show SMILES CC1(C)CCC(CN2CCN(CC2)c2ccc(C(=O)NS(=O)(=O)c3ccc(NCC4CCOCC4)c(c3)[N+]([O-])=O)c(Oc3cnc(N)c(Br)c3)c2)=C(C1)c1ccc(Cl)cc1 |c:55|
Show InChI InChI=1S/C43H49BrClN7O7S/c1-43(2)14-11-30(36(24-43)29-3-5-31(45)6-4-29)27-50-15-17-51(18-16-50)32-7-9-35(40(21-32)59-33-22-37(44)41(46)48-26-33)42(53)49-60(56,57)34-8-10-38(39(23-34)52(54)55)47-25-28-12-19-58-20-13-28/h3-10,21-23,26,28,47H,11-20,24-25,27H2,1-2H3,(H2,46,48)(H,49,53)
US Patent
<0.0100<-15.0n/an/an/an/an/an/a25
AbbVie Inc.; The Walter and Eliza Hall Institute of Medical Research
US Patent
Assay Description
Representative compounds were serially diluted in dimethyl sulfoxide (DMSO) starting at 50 uM (2x starting concentration; 10% DMSO) and 10 uL were tr...
US Patent US8952157 (2015)
BindingDB Entry DOI: 10.7270/Q2QN65G9