BDBM145374 US8952169, 153
SMILES: CS(=O)(=O)NC(=O)c1cc(C2CC2)c(OCC23CC4CC(C2)C(F)(F)C(C4)C3)cc1F
InChI Key: InChIKey=MSLIEPIIAJYDTK-UHFFFAOYSA-N
Data: 2 IC50
Activity Spreadsheet -- Enzyme Inhibition Constant Data from BindingDB
Found 2 hits for monomerid = 145374
Trg + Lig
Ki
nM
ΔG°
kcal/mole
IC50
nM
Kd
nM
EC50/IC50
nM
koff
s-1
kon
M-1s-1
pHTemp
°C
Sodium channel protein type 5 subunit alpha
(Homo sapiens (Human))
BDBM145374
(US8952169, 153)
Show SMILES CS(=O)(=O)NC(=O)c1cc(C2CC2)c(OCC23CC4CC(C2)C(F)(F)C(C4)C3)cc1F |TLB:15:16:22:19.18.26,THB:17:16:22:19.18.26,17:18:22:16.27.21,27:16:19:22.25.26,27:25:19:16.17.21|
Show InChI InChI=1S/C22H26F3NO4S/c1-31(28,29)26-20(27)17-6-16(13-2-3-13)19(7-18(17)23)30-11-21-8-12-4-14(9-21)22(24,25)15(5-12)10-21/h6-7,12-15H,2-5,8-11H2,1H3,(H,26,27)
US Patent
n/an/a 714n/an/an/an/an/a37
Xenon Pharmaceuticals Inc.; Genentech, Inc.
US Patent
Assay Description
Patch voltage clamp electrophysiology allows for the direct measurement and quantification of block of voltage-gated sodium channels (NaV's), and all...
US Patent US8952169 (2015)
BindingDB Entry DOI: 10.7270/Q2M04445
Sodium channel protein type 9 subunit alpha
(Homo sapiens (Human))
BDBM145374
(US8952169, 153)
Show SMILES CS(=O)(=O)NC(=O)c1cc(C2CC2)c(OCC23CC4CC(C2)C(F)(F)C(C4)C3)cc1F |TLB:15:16:22:19.18.26,THB:17:16:22:19.18.26,17:18:22:16.27.21,27:16:19:22.25.26,27:25:19:16.17.21|
Show InChI InChI=1S/C22H26F3NO4S/c1-31(28,29)26-20(27)17-6-16(13-2-3-13)19(7-18(17)23)30-11-21-8-12-4-14(9-21)22(24,25)15(5-12)10-21/h6-7,12-15H,2-5,8-11H2,1H3,(H,26,27)
US Patent
n/an/a 1n/an/an/an/a7.425
Xenon Pharmaceuticals Inc.; Genentech, Inc.
US Patent
Assay Description
Radioligand Binding Studies: Saturation experiments. A representative compound of formula (I) was tritiated. Three tritiums were incorporated in plac...
US Patent US8952169 (2015)
BindingDB Entry DOI: 10.7270/Q2M04445