BDBM1454 3-amino-N-{3-[cyclopropyl({4-hydroxy-2-oxo-2H,5H,6H,7H,8H,9H,10H-cycloocta[b]pyran-3-yl})methyl]phenyl}benzene-1-sulfonamide::Sulfonamide-Substituted Cyclooctylpyranone deriv. 34h
SMILES: Nc1cccc(c1)S(=O)(=O)Nc1cccc(c1)C(C1CC1)c1c(O)c2CCCCCCc2oc1=O
InChI Key: InChIKey=AOZZDVARVHBKHM-UHFFFAOYSA-N
Data: 1 KI
Activity Spreadsheet -- Enzyme Inhibition Constant Data from BindingDB
Found 1 hit for monomerid = 1454
Trg + Lig
Ki
nM
ΔG°
kcal/mole
IC50
nM
Kd
nM
EC50/IC50
nM
koff
s-1
kon
M-1s-1
pHTemp
°C
HIV-1 Protease
(Human immunodeficiency virus type 1)
BDBM1454
(3-amino-N-{3-[cyclopropyl({4-hydroxy-2-oxo-2H,5H,6...)
Show SMILES Nc1cccc(c1)S(=O)(=O)Nc1cccc(c1)C(C1CC1)c1c(O)c2CCCCCCc2oc1=O
Show InChI InChI=1S/C27H30N2O5S/c28-19-8-6-10-21(16-19)35(32,33)29-20-9-5-7-18(15-20)24(17-13-14-17)25-26(30)22-11-3-1-2-4-12-23(22)34-27(25)31/h5-10,15-17,24,29-30H,1-4,11-14,28H2
2.30 -11.7n/an/an/an/an/a5.022
Upjohn
Assay Description
HIV-1 protease was purified and refolded from E. coli inclusion bodies. The substrate used spans the p17-p24 processing site (R-V-S-Q-N-Y-P-I-V-Q-N-K...
J Med Chem 40: 1149-64 (1997)
Article DOI: 10.1021/jm960441m
BindingDB Entry DOI: 10.7270/Q2736P28