BDBM14552 2-[6-(3-aminophenyl)-5-chloro-3-[(3-hydroxypropyl)amino]-2-oxo-1,2-dihydropyrazin-1-yl]-N-[(4-carbamimidoylphenyl)methyl]acetamide::Pyrazinone Analog 29h
SMILES: NC(=N)c1ccc(CNC(=O)Cn2c(c(Cl)nc(NCCCO)c2=O)-c2cccc(N)c2)cc1
InChI Key: InChIKey=YYPGTPOHBYCYEU-UHFFFAOYSA-N
Data: 2 IC50
Activity Spreadsheet -- Enzyme Inhibition Constant Data from BindingDB
Found 2 hits for monomerid = 14552
Trg + Lig
Ki
nM
ΔG°
kcal/mole
IC50
nM
Kd
nM
EC50/IC50
nM
koff
s-1
kon
M-1s-1
pHTemp
°C
Coagulation factor VII
(Homo sapiens (Human))
BDBM14552
(2-[6-(3-aminophenyl)-5-chloro-3-[(3-hydroxypropyl)...)
Show SMILES NC(=N)c1ccc(CNC(=O)Cn2c(c(Cl)nc(NCCCO)c2=O)-c2cccc(N)c2)cc1
Show InChI InChI=1S/C23H26ClN7O3/c24-20-19(16-3-1-4-17(25)11-16)31(23(34)22(30-20)28-9-2-10-32)13-18(33)29-12-14-5-7-15(8-6-14)21(26)27/h1,3-8,11,32H,2,9-10,12-13,25H2,(H3,26,27)(H,28,30)(H,29,33)
Reactome pathway
n/an/a 90n/an/an/an/an/an/a
Pharmacia Corporation
Assay Description
Recombinant human Factor VIIa and soluble tissue factor were added to a 96-well assay plate containing substrate and inhibitor in reaction buffer. Th...
J Med Chem 46: 4050-62 (2003)
Article DOI: 10.1021/jm030131l
BindingDB Entry DOI: 10.7270/Q2FT8J9M
Prothrombin
(Homo sapiens (Human))
BDBM14552
(2-[6-(3-aminophenyl)-5-chloro-3-[(3-hydroxypropyl)...)
Show SMILES NC(=N)c1ccc(CNC(=O)Cn2c(c(Cl)nc(NCCCO)c2=O)-c2cccc(N)c2)cc1
Show InChI InChI=1S/C23H26ClN7O3/c24-20-19(16-3-1-4-17(25)11-16)31(23(34)22(30-20)28-9-2-10-32)13-18(33)29-12-14-5-7-15(8-6-14)21(26)27/h1,3-8,11,32H,2,9-10,12-13,25H2,(H3,26,27)(H,28,30)(H,29,33)
n/an/a>3.00E+4n/an/an/an/an/an/a
Pharmacia Corporation
Assay Description
Human thrombin and substrate were added to a 96-well assay plate containing inhibitor in reaction buffer. The rate of hydrolysis of the substrate was...
J Med Chem 46: 4050-62 (2003)
Article DOI: 10.1021/jm030131l
BindingDB Entry DOI: 10.7270/Q2FT8J9M