BDBM146998 US8957074, 37
SMILES: CN(C)C(=O)c1cc2cnc(Nc3ccc(cn3)C(=O)N3CC4CCC(C3)N4)nc2n1[C@H]1CC[C@@H](CC1)C(C)(C)C
InChI Key: InChIKey=WOZPHGMYKYVQOK-CFBZESNVSA-N
Data: 2 IC50
Activity Spreadsheet -- Enzyme Inhibition Constant Data from BindingDB
Found 2 hits for monomerid = 146998
Trg + Lig
Ki
nM
ΔG°
kcal/mole
IC50
nM
Kd
nM
EC50/IC50
nM
koff
s-1
kon
M-1s-1
pHTemp
°C
Cyclin-dependent kinase 1
(Homo sapiens (Human))
BDBM146998
(US8957074, 37)
Show SMILES CN(C)C(=O)c1cc2cnc(Nc3ccc(cn3)C(=O)N3CC4CCC(C3)N4)nc2n1[C@H]1CC[C@@H](CC1)C(C)(C)C |r,wU:31.35,wD:34.42,(3.47,1.95,;4.24,3.29,;5.78,3.29,;3.47,4.62,;4.24,5.95,;1.93,4.62,;1.02,5.87,;-.44,5.39,;-1.78,6.16,;-3.11,5.39,;-3.11,3.85,;-4.44,3.08,;-4.44,1.54,;-3.11,.77,;-3.11,-.77,;-4.44,-1.54,;-5.78,-.77,;-5.78,.77,;-4.44,-3.08,;-5.78,-3.85,;-3.11,-3.85,;-1.78,-3.08,;-.44,-3.85,;-1.71,-4.03,;-2.26,-5.02,;-1.78,-6.16,;-3.11,-5.39,;-.44,-5.39,;-1.78,3.08,;-.44,3.85,;1.02,3.37,;1.42,1.89,;2.91,1.49,;3.31,0,;2.22,-1.09,;.73,-.69,;.33,.8,;2.62,-2.58,;4.1,-2.97,;1.53,-3.67,;3.02,-4.06,)|
Show InChI InChI=1S/C31H42N8O2/c1-31(2,3)21-7-11-24(12-8-21)39-25(29(41)37(4)5)14-20-16-33-30(36-27(20)39)35-26-13-6-19(15-32-26)28(40)38-17-22-9-10-23(18-38)34-22/h6,13-16,21-24,34H,7-12,17-18H2,1-5H3,(H,32,33,35,36)/t21-,22?,23?,24-
Reactome pathway
US Patent
n/an/a>1.50E+4n/an/an/an/an/a25
Novartis AG
US Patent
Assay Description
A 384-well microtiter IMAP-FP (Molecular Devices Trade Mark Technology) endpoint assay was used for CDK1/cyclin B kinase activity measurements. The s...
US Patent US8957074 (2015)
BindingDB Entry DOI: 10.7270/Q2K0730S
Cyclin-dependent kinase 4
(Homo sapiens (Human))
BDBM146998
(US8957074, 37)
Show SMILES CN(C)C(=O)c1cc2cnc(Nc3ccc(cn3)C(=O)N3CC4CCC(C3)N4)nc2n1[C@H]1CC[C@@H](CC1)C(C)(C)C |r,wU:31.35,wD:34.42,(3.47,1.95,;4.24,3.29,;5.78,3.29,;3.47,4.62,;4.24,5.95,;1.93,4.62,;1.02,5.87,;-.44,5.39,;-1.78,6.16,;-3.11,5.39,;-3.11,3.85,;-4.44,3.08,;-4.44,1.54,;-3.11,.77,;-3.11,-.77,;-4.44,-1.54,;-5.78,-.77,;-5.78,.77,;-4.44,-3.08,;-5.78,-3.85,;-3.11,-3.85,;-1.78,-3.08,;-.44,-3.85,;-1.71,-4.03,;-2.26,-5.02,;-1.78,-6.16,;-3.11,-5.39,;-.44,-5.39,;-1.78,3.08,;-.44,3.85,;1.02,3.37,;1.42,1.89,;2.91,1.49,;3.31,0,;2.22,-1.09,;.73,-.69,;.33,.8,;2.62,-2.58,;4.1,-2.97,;1.53,-3.67,;3.02,-4.06,)|
Show InChI InChI=1S/C31H42N8O2/c1-31(2,3)21-7-11-24(12-8-21)39-25(29(41)37(4)5)14-20-16-33-30(36-27(20)39)35-26-13-6-19(15-32-26)28(40)38-17-22-9-10-23(18-38)34-22/h6,13-16,21-24,34H,7-12,17-18H2,1-5H3,(H,32,33,35,36)/t21-,22?,23?,24-
NCI pathway
Reactome pathway
US Patent
n/an/a 5.5n/an/an/an/a7.522
Novartis AG
US Patent
Assay Description
An assay for monitoring CDK4/cyclin D1-catalyzed phosphorylation of pRb at the Ser780 site was performed using TR-FRET in a 384-well format, and was ...
US Patent US8957074 (2015)
BindingDB Entry DOI: 10.7270/Q2K0730S