BDBM147053 US8957074, 93
SMILES: CN(C)C(=O)c1cc2cnc(Nc3ccc(cn3)N3C[C@@H]4CN(C)C[C@@H]4CC3=O)nc2n1C1CCCCCC1
InChI Key: InChIKey=QHKSOUNRROAMGU-SFTDATJTSA-N
Data: 2 IC50
Activity Spreadsheet -- Enzyme Inhibition Constant Data from BindingDB
Found 2 hits for monomerid = 147053
Trg + Lig
Ki
nM
ΔG°
kcal/mole
IC50
nM
Kd
nM
EC50/IC50
nM
koff
s-1
kon
M-1s-1
pHTemp
°C
Cyclin-dependent kinase 1
(Homo sapiens (Human))
BDBM147053
(US8957074, 93)
Show SMILES CN(C)C(=O)c1cc2cnc(Nc3ccc(cn3)N3C[C@@H]4CN(C)C[C@@H]4CC3=O)nc2n1C1CCCCCC1 |r|
Show InChI InChI=1S/C29H38N8O2/c1-34(2)28(39)24-12-19-14-31-29(33-27(19)37(24)22-8-6-4-5-7-9-22)32-25-11-10-23(15-30-25)36-18-21-17-35(3)16-20(21)13-26(36)38/h10-12,14-15,20-22H,4-9,13,16-18H2,1-3H3,(H,30,31,32,33)/t20-,21-/m0/s1
Reactome pathway
US Patent
n/an/a>1.50E+4n/an/an/an/an/a25
Novartis AG
US Patent
Assay Description
A 384-well microtiter IMAP-FP (Molecular Devices Trade Mark Technology) endpoint assay was used for CDK1/cyclin B kinase activity measurements. The s...
US Patent US8957074 (2015)
BindingDB Entry DOI: 10.7270/Q2K0730S
Cyclin-dependent kinase 4
(Homo sapiens (Human))
BDBM147053
(US8957074, 93)
Show SMILES CN(C)C(=O)c1cc2cnc(Nc3ccc(cn3)N3C[C@@H]4CN(C)C[C@@H]4CC3=O)nc2n1C1CCCCCC1 |r|
Show InChI InChI=1S/C29H38N8O2/c1-34(2)28(39)24-12-19-14-31-29(33-27(19)37(24)22-8-6-4-5-7-9-22)32-25-11-10-23(15-30-25)36-18-21-17-35(3)16-20(21)13-26(36)38/h10-12,14-15,20-22H,4-9,13,16-18H2,1-3H3,(H,30,31,32,33)/t20-,21-/m0/s1
NCI pathway
Reactome pathway
US Patent
n/an/a<5n/an/an/an/a7.522
Novartis AG
US Patent
Assay Description
An assay for monitoring CDK4/cyclin D1-catalyzed phosphorylation of pRb at the Ser780 site was performed using TR-FRET in a 384-well format, and was ...
US Patent US8957074 (2015)
BindingDB Entry DOI: 10.7270/Q2K0730S