BDBM147198 US8957093, 6
SMILES: C[C@@H](NC(=O)c1ccc2n(Cc3ccc(cc3)-c3ccccc3C(O)=O)c(C)c(C)c2c1)c1ccc(Br)cc1
InChI Key: InChIKey=HBMXDCXJXYASGW-OAQYLSRUSA-N
Data: 2 IC50  1 EC50
Activity Spreadsheet -- Enzyme Inhibition Constant Data from BindingDB
Found 3 hits for monomerid = 147198
Trg + Lig
Ki
nM
ΔG°
kcal/mole
IC50
nM
Kd
nM
EC50/IC50
nM
koff
s-1
kon
M-1s-1
pHTemp
°C
Peroxisome proliferator-activated receptor
(Homo sapiens (Human))
BDBM147198
(US8957093, 6)
Show SMILES C[C@@H](NC(=O)c1ccc2n(Cc3ccc(cc3)-c3ccccc3C(O)=O)c(C)c(C)c2c1)c1ccc(Br)cc1 |r|
Show InChI InChI=1S/C33H29BrN2O3/c1-20-22(3)36(19-23-8-10-25(11-9-23)28-6-4-5-7-29(28)33(38)39)31-17-14-26(18-30(20)31)32(37)35-21(2)24-12-15-27(34)16-13-24/h4-18,21H,19H2,1-3H3,(H,35,37)(H,38,39)/t21-/m1/s1
NCI pathway
Reactome pathway
US Patent
n/an/a 0.700n/an/an/an/an/an/a
The Scripps Research Institute
US Patent
Assay Description
The assay was performed according to manufacturer protocol. A mixture of nM GST-PPARG-LBD, 5 nM Tb-GST-antibody, 5 nM Fluormone Pan-PPAR Green, and s...
US Patent US8957093 (2015)
BindingDB Entry DOI: 10.7270/Q2X63KNR
Peroxisome proliferator-activated receptor
(Homo sapiens (Human))
BDBM147198
(US8957093, 6)
Show SMILES C[C@@H](NC(=O)c1ccc2n(Cc3ccc(cc3)-c3ccccc3C(O)=O)c(C)c(C)c2c1)c1ccc(Br)cc1 |r|
Show InChI InChI=1S/C33H29BrN2O3/c1-20-22(3)36(19-23-8-10-25(11-9-23)28-6-4-5-7-29(28)33(38)39)31-17-14-26(18-30(20)31)32(37)35-21(2)24-12-15-27(34)16-13-24/h4-18,21H,19H2,1-3H3,(H,35,37)(H,38,39)/t21-/m1/s1
NCI pathway
Reactome pathway
n/an/an/an/a 129n/an/an/an/a
The Scripps Research Institute
Curated by ChEMBL
Assay Description
Transactivation of human PPARgamma in HEK293T cells after 18 hrs by luciferase reporter gene assay
ACS Med Chem Lett 6: 998-1003 (2015)
Article DOI: 10.1021/acsmedchemlett.5b00218
BindingDB Entry DOI: 10.7270/Q29026SZ
Peroxisome proliferator-activated receptor
(Homo sapiens (Human))
BDBM147198
(US8957093, 6)
Show SMILES C[C@@H](NC(=O)c1ccc2n(Cc3ccc(cc3)-c3ccccc3C(O)=O)c(C)c(C)c2c1)c1ccc(Br)cc1 |r|
Show InChI InChI=1S/C33H29BrN2O3/c1-20-22(3)36(19-23-8-10-25(11-9-23)28-6-4-5-7-29(28)33(38)39)31-17-14-26(18-30(20)31)32(37)35-21(2)24-12-15-27(34)16-13-24/h4-18,21H,19H2,1-3H3,(H,35,37)(H,38,39)/t21-/m1/s1
NCI pathway
Reactome pathway
n/an/a 0.730n/an/an/an/an/an/a
The Scripps Research Institute
Curated by ChEMBL
Assay Description
Binding affinity to GST-tagged PPAR-gamma-LBD (unknown origin) after 2 hrs by Lantha screen assay using fluormone Pan-PPAR green probe
ACS Med Chem Lett 6: 998-1003 (2015)
Article DOI: 10.1021/acsmedchemlett.5b00218
BindingDB Entry DOI: 10.7270/Q29026SZ