BDBM148169 US8962612, 80
SMILES: [#7]\[#6](-[#7])=[#7]\[#6](=O)-[#7]-1-[#6]-c2c(ccc(F)c2C2([#6]-[#6]2)[#6]-1)-c1ccc(F)cc1F
InChI Key: InChIKey=ZLYMYIVRKUBUPL-UHFFFAOYSA-N
Data: 1 KI
Activity Spreadsheet -- Enzyme Inhibition Constant Data from BindingDB
Found 1 hit for monomerid = 148169
Trg + Lig
Ki
nM
ΔG°
kcal/mole
IC50
nM
Kd
nM
EC50/IC50
nM
koff
s-1
kon
M-1s-1
pHTemp
°C
5-hydroxytryptamine receptor 5A
(Homo sapiens (Human))
BDBM148169
(US8962612, 80)
Show SMILES [#7]\[#6](-[#7])=[#7]\[#6](=O)-[#7]-1-[#6]-c2c(ccc(F)c2C2([#6]-[#6]2)[#6]-1)-c1ccc(F)cc1F
Show InChI InChI=1S/C19H17F3N4O/c20-10-1-2-12(15(22)7-10)11-3-4-14(21)16-13(11)8-26(9-19(16)5-6-19)18(27)25-17(23)24/h1-4,7H,5-6,8-9H2,(H4,23,24,25,27)
US Patent
0.850 -12.9n/an/an/an/an/a7.437
Astellas Pharma Inc.
US Patent
Assay Description
A test compound and 150 uM of a DMSO solution of 5-carboxamide tryptamine (5-CT) were added to a 96-well plate at 2 ul/well and suspended in the incu...
US Patent US8962612 (2015)
BindingDB Entry DOI: 10.7270/Q24Q7SQP