BDBM148170 US8962612, 81
SMILES: [#7]\[#6](-[#7])=[#7]\[#6](=O)-[#7]-1-[#6]-[#6]-c2cccc(c2-[#6]-1)-c1ncc(F)cc1F
InChI Key: InChIKey=MHHZYOAQRLXCDU-UHFFFAOYSA-N
Data: 1 KI
Activity Spreadsheet -- Enzyme Inhibition Constant Data from BindingDB
Found 1 hit for monomerid = 148170
Trg + Lig
Ki
nM
ΔG°
kcal/mole
IC50
nM
Kd
nM
EC50/IC50
nM
koff
s-1
kon
M-1s-1
pHTemp
°C
5-hydroxytryptamine receptor 5A
(Homo sapiens (Human))
BDBM148170
(US8962612, 81)
Show SMILES [#7]\[#6](-[#7])=[#7]\[#6](=O)-[#7]-1-[#6]-[#6]-c2cccc(c2-[#6]-1)-c1ncc(F)cc1F
Show InChI InChI=1S/C16H15F2N5O/c17-10-6-13(18)14(21-7-10)11-3-1-2-9-4-5-23(8-12(9)11)16(24)22-15(19)20/h1-3,6-7H,4-5,8H2,(H4,19,20,22,24)
US Patent
4.20 -11.9n/an/an/an/an/a7.437
Astellas Pharma Inc.
US Patent
Assay Description
A test compound and 150 uM of a DMSO solution of 5-carboxamide tryptamine (5-CT) were added to a 96-well plate at 2 ul/well and suspended in the incu...
US Patent US8962612 (2015)
BindingDB Entry DOI: 10.7270/Q24Q7SQP