BDBM14983 4-Methyl-3-(3-(2-(methylamino)pyrimidin-4-yl)pyridin-2-yloxy)-N-(2-morpholino-5-(trifluoromethyl)phenyl)benzamide::4-methyl-3-({3-[2-(methylamino)pyrimidin-4-yl]pyridin-2-yl}oxy)-N-[2-(morpholin-4-yl)-5-(trifluoromethyl)phenyl]benzamide::CHEMBL219158::pyridinyl pyrimidine 47
SMILES: CNc1nccc(n1)-c1cccnc1Oc1cc(ccc1C)C(=O)Nc1cc(ccc1N1CCOCC1)C(F)(F)F
InChI Key: InChIKey=HHKWHHAJTWLRKG-UHFFFAOYSA-N
Data: 4 IC50
PDB links: 1 PDB ID matches this monomer.
Activity Spreadsheet -- Enzyme Inhibition Constant Data from BindingDB
Found 4 hits for monomerid = 14983
Trg + Lig
Ki
nM
ΔG°
kcal/mole
IC50
nM
Kd
nM
EC50/IC50
nM
koff
s-1
kon
M-1s-1
pHTemp
°C
Angiopoietin-1 receptor
(Homo sapiens (Human))
BDBM14983
(4-Methyl-3-(3-(2-(methylamino)pyrimidin-4-yl)pyrid...)
Show SMILES CNc1nccc(n1)-c1cccnc1Oc1cc(ccc1C)C(=O)Nc1cc(ccc1N1CCOCC1)C(F)(F)F
Show InChI InChI=1S/C29H27F3N6O3/c1-18-5-6-19(16-25(18)41-27-21(4-3-10-34-27)22-9-11-35-28(33-2)37-22)26(39)36-23-17-20(29(30,31)32)7-8-24(23)38-12-14-40-15-13-38/h3-11,16-17H,12-15H2,1-2H3,(H,36,39)(H,33,35,37)
n/an/a 10n/an/an/an/a7.522
Amgen
Assay Description
The assay uses purified enzyme interacting with biotinylated peptide substrate. HTRF is based on the proximity of europium cryptate (donor fluorophor...
J Med Chem 50: 611-26 (2007)
Article DOI: 10.1021/jm061107l
BindingDB Entry DOI: 10.7270/Q2MC8X8S
3D
3D Structure (crystal)
Vascular endothelial growth factor receptor 2
(Homo sapiens (Human))
BDBM14983
(4-Methyl-3-(3-(2-(methylamino)pyrimidin-4-yl)pyrid...)
Show SMILES CNc1nccc(n1)-c1cccnc1Oc1cc(ccc1C)C(=O)Nc1cc(ccc1N1CCOCC1)C(F)(F)F
Show InChI InChI=1S/C29H27F3N6O3/c1-18-5-6-19(16-25(18)41-27-21(4-3-10-34-27)22-9-11-35-28(33-2)37-22)26(39)36-23-17-20(29(30,31)32)7-8-24(23)38-12-14-40-15-13-38/h3-11,16-17H,12-15H2,1-2H3,(H,36,39)(H,33,35,37)
NCI pathway
Reactome pathway
n/an/a 310n/an/an/an/an/an/a
Amgen Inc.
Curated by ChEMBL
Assay Description
Inhibition of KDR
Bioorg Med Chem Lett 19: 424-7 (2008)
Article DOI: 10.1016/j.bmcl.2008.11.056
BindingDB Entry DOI: 10.7270/Q29P31HK
Angiopoietin-1 receptor
(Homo sapiens (Human))
BDBM14983
(4-Methyl-3-(3-(2-(methylamino)pyrimidin-4-yl)pyrid...)
Show SMILES CNc1nccc(n1)-c1cccnc1Oc1cc(ccc1C)C(=O)Nc1cc(ccc1N1CCOCC1)C(F)(F)F
Show InChI InChI=1S/C29H27F3N6O3/c1-18-5-6-19(16-25(18)41-27-21(4-3-10-34-27)22-9-11-35-28(33-2)37-22)26(39)36-23-17-20(29(30,31)32)7-8-24(23)38-12-14-40-15-13-38/h3-11,16-17H,12-15H2,1-2H3,(H,36,39)(H,33,35,37)
n/an/a 10n/an/an/an/an/an/a
Amgen Inc.
Curated by ChEMBL
Assay Description
Inhibition of Tie2 (unknown origin)
Bioorg Med Chem Lett 19: 424-7 (2008)
Article DOI: 10.1016/j.bmcl.2008.11.056
BindingDB Entry DOI: 10.7270/Q29P31HK
3D
3D Structure (crystal)
Vascular endothelial growth factor receptor 2
(Homo sapiens (Human))
BDBM14983
(4-Methyl-3-(3-(2-(methylamino)pyrimidin-4-yl)pyrid...)
Show SMILES CNc1nccc(n1)-c1cccnc1Oc1cc(ccc1C)C(=O)Nc1cc(ccc1N1CCOCC1)C(F)(F)F
Show InChI InChI=1S/C29H27F3N6O3/c1-18-5-6-19(16-25(18)41-27-21(4-3-10-34-27)22-9-11-35-28(33-2)37-22)26(39)36-23-17-20(29(30,31)32)7-8-24(23)38-12-14-40-15-13-38/h3-11,16-17H,12-15H2,1-2H3,(H,36,39)(H,33,35,37)
NCI pathway
Reactome pathway
n/an/a 310n/an/an/an/an/an/a
Amgen
Assay Description
The assay uses purified enzyme interacting with biotinylated peptide substrate. HTRF is based on the proximity of europium cryptate (donor fluorophor...
J Med Chem 50: 611-26 (2007)
Article DOI: 10.1021/jm061107l
BindingDB Entry DOI: 10.7270/Q2MC8X8S