BDBM150212 US8980906, 13
SMILES: COc1ccc2C[C@H]3N(CC4CC4)CC[C@@]4(Cc5[nH]c(=O)c(cc5C[C@@]34O)C(=O)NCC(N)=O)c2c1
InChI Key:
Data: 1 KI
Activity Spreadsheet -- Enzyme Inhibition Constant Data from BindingDB
Found 1 hit for monomerid = 150212
Trg + Lig
Ki
nM
ΔG°
kcal/mole
IC50
nM
Kd
nM
EC50/IC50
nM
koff
s-1
kon
M-1s-1
pHTemp
°C
Kappa-type opioid receptor
(Homo sapiens (Human))
BDBM150212
(US8980906, 13)
Show SMILES COc1ccc2C[C@H]3N(CC4CC4)CC[C@@]4(Cc5[nH]c(=O)c(cc5C[C@@]34O)C(=O)NCC(N)=O)c2c1 |r|
Reactome pathway
US Patent
467n/an/an/an/an/an/a7.4n/a
Purdue Pharma L.P.
US Patent
Assay Description
Radioligand dose displacement assays used 0.4 nM [3H]-U69,593 (GE Healthcare, Piscataway, N.J.; 40 Ci/mmole) with 15 μg membrane protein (recomb...
US Patent US8980906 (2015)
BindingDB Entry DOI: 10.7270/Q2W37V15