BDBM150830 US8981106, 19::USRE47267, Compound 19
SMILES: CC1(C)OB(OC1(C)C)c1ccc(OC(F)(F)F)cc1CSc1ccc(cn1)C(=O)Nc1ccc(F)cc1
InChI Key: InChIKey=KUUXJYNTDOOIJP-UHFFFAOYSA-N
Data: 2 IC50
Activity Spreadsheet -- Enzyme Inhibition Constant Data from BindingDB
Found 2 hits for monomerid = 150830
Trg + Lig
Ki
nM
ΔG°
kcal/mole
IC50
nM
Kd
nM
EC50/IC50
nM
koff
s-1
kon
M-1s-1
pHTemp
°C
C-X-C chemokine receptor type 2
(Homo sapiens (Human))
BDBM150830
(US8981106, 19 | USRE47267, Compound 19)
Show SMILES CC1(C)OB(OC1(C)C)c1ccc(OC(F)(F)F)cc1CSc1ccc(cn1)C(=O)Nc1ccc(F)cc1
Show InChI InChI=1S/C26H25BF4N2O4S/c1-24(2)25(3,4)37-27(36-24)21-11-10-20(35-26(29,30)31)13-17(21)15-38-22-12-5-16(14-32-22)23(34)33-19-8-6-18(28)7-9-19/h5-14H,15H2,1-4H3,(H,33,34)
Reactome pathway
US Patent
n/an/a 72n/an/an/an/an/an/a
Syntrix Biosystems, Inc.
US Patent
Assay Description
The assay is a Ca2+ mobilization assay that measures changes in intracellular Ca2+ with a FlexStation II scanning fluorometer using a FLIPR-3 Calcium...
US Patent USRE47267 (2019)
BindingDB Entry DOI: 10.7270/Q2GF0WSH
C-X-C chemokine receptor type 2
(Homo sapiens (Human))
BDBM150830
(US8981106, 19 | USRE47267, Compound 19)
Show SMILES CC1(C)OB(OC1(C)C)c1ccc(OC(F)(F)F)cc1CSc1ccc(cn1)C(=O)Nc1ccc(F)cc1
Show InChI InChI=1S/C26H25BF4N2O4S/c1-24(2)25(3,4)37-27(36-24)21-11-10-20(35-26(29,30)31)13-17(21)15-38-22-12-5-16(14-32-22)23(34)33-19-8-6-18(28)7-9-19/h5-14H,15H2,1-4H3,(H,33,34)
Reactome pathway
US Patent
n/an/a 72n/an/an/an/an/a37
Syntrix Biosystems, Inc.
US Patent
Assay Description
An in vitro assay showed inhibition of CXCR2-mediated intracellular calcium release. Briefly, human neutrophils were suspended in HBSS- (without Ca2+...
US Patent US8981106 (2015)
BindingDB Entry DOI: 10.7270/Q2WW7GC1