BDBM150858 US8981106, 47
SMILES: Cc1n[nH]c(C)c1CCSc1ccc(cn1)C(=O)Nc1ccc(F)cc1
InChI Key: InChIKey=UOPBDXXLYDCFTN-UHFFFAOYSA-N
Data: 2 IC50
Activity Spreadsheet -- Enzyme Inhibition Constant Data from BindingDB
Found 2 hits for monomerid = 150858
Trg + Lig
Ki
nM
ΔG°
kcal/mole
IC50
nM
Kd
nM
EC50/IC50
nM
koff
s-1
kon
M-1s-1
pHTemp
°C
C-X-C chemokine receptor type 2
(Homo sapiens (Human))
BDBM150858
(US8981106, 47)
Show SMILES Cc1n[nH]c(C)c1CCSc1ccc(cn1)C(=O)Nc1ccc(F)cc1
Show InChI InChI=1S/C19H19FN4OS/c1-12-17(13(2)24-23-12)9-10-26-18-8-3-14(11-21-18)19(25)22-16-6-4-15(20)5-7-16/h3-8,11H,9-10H2,1-2H3,(H,22,25)(H,23,24)
Reactome pathway
n/an/a>5.00E+3n/an/an/an/an/an/a
Syntrix Biosystems
Curated by ChEMBL
Assay Description
Antagonist activity at CXCR2 in human PMNs assessed as inhibition of CXCL1-induced intracellular Ca2+ release by fluorescence based calcium flux assa...
J Med Chem 57: 8378-97 (2014)
Article DOI: 10.1021/jm500827t
BindingDB Entry DOI: 10.7270/Q2FX7C22
C-X-C chemokine receptor type 2
(Homo sapiens (Human))
BDBM150858
(US8981106, 47)
Show SMILES Cc1n[nH]c(C)c1CCSc1ccc(cn1)C(=O)Nc1ccc(F)cc1
Show InChI InChI=1S/C19H19FN4OS/c1-12-17(13(2)24-23-12)9-10-26-18-8-3-14(11-21-18)19(25)22-16-6-4-15(20)5-7-16/h3-8,11H,9-10H2,1-2H3,(H,22,25)(H,23,24)
Reactome pathway
US Patent
n/an/a>5.00E+3n/an/an/an/an/a37
Syntrix Biosystems, Inc.
US Patent
Assay Description
An in vitro assay showed inhibition of CXCR2-mediated intracellular calcium release. Briefly, human neutrophils were suspended in HBSS- (without Ca2+...
US Patent US8981106 (2015)
BindingDB Entry DOI: 10.7270/Q2WW7GC1