BDBM150968 US8981106, 158::USRE47267, Compound 158
SMILES: OB(O)c1ccccc1CSc1ccc(cn1)C(=O)N(CC(O)=O)c1ccc(F)cc1
InChI Key: InChIKey=YDYSHHNSZKNUQE-UHFFFAOYSA-N
Data: 3 IC50
Activity Spreadsheet -- Enzyme Inhibition Constant Data from BindingDB
Found 3 hits for monomerid = 150968
Trg + Lig
Ki
nM
ΔG°
kcal/mole
IC50
nM
Kd
nM
EC50/IC50
nM
koff
s-1
kon
M-1s-1
pHTemp
°C
C-X-C chemokine receptor type 2
(Homo sapiens (Human))
BDBM150968
(US8981106, 158 | USRE47267, Compound 158)
Show SMILES OB(O)c1ccccc1CSc1ccc(cn1)C(=O)N(CC(O)=O)c1ccc(F)cc1
Show InChI InChI=1S/C21H18BFN2O5S/c23-16-6-8-17(9-7-16)25(12-20(26)27)21(28)14-5-10-19(24-11-14)31-13-15-3-1-2-4-18(15)22(29)30/h1-11,29-30H,12-13H2,(H,26,27)
Reactome pathway
US Patent
n/an/a 1.99E+3n/an/an/an/an/a37
Syntrix Biosystems, Inc.
US Patent
Assay Description
An in vitro assay showed inhibition of CXCR2-mediated intracellular calcium release. Briefly, human neutrophils were suspended in HBSS- (without Ca2+...
US Patent US8981106 (2015)
BindingDB Entry DOI: 10.7270/Q2WW7GC1
C-X-C chemokine receptor type 2
(Homo sapiens (Human))
BDBM150968
(US8981106, 158 | USRE47267, Compound 158)
Show SMILES OB(O)c1ccccc1CSc1ccc(cn1)C(=O)N(CC(O)=O)c1ccc(F)cc1
Show InChI InChI=1S/C21H18BFN2O5S/c23-16-6-8-17(9-7-16)25(12-20(26)27)21(28)14-5-10-19(24-11-14)31-13-15-3-1-2-4-18(15)22(29)30/h1-11,29-30H,12-13H2,(H,26,27)
Reactome pathway
US Patent
n/an/a 1.99E+3n/an/an/an/an/an/a
Syntrix Biosystems, Inc.
US Patent
Assay Description
The assay is a Ca2+ mobilization assay that measures changes in intracellular Ca2+ with a FlexStation II scanning fluorometer using a FLIPR-3 Calcium...
US Patent USRE47267 (2019)
BindingDB Entry DOI: 10.7270/Q2GF0WSH
C-X-C chemokine receptor type 2
(Homo sapiens (Human))
BDBM150968
(US8981106, 158 | USRE47267, Compound 158)
Show SMILES OB(O)c1ccccc1CSc1ccc(cn1)C(=O)N(CC(O)=O)c1ccc(F)cc1
Show InChI InChI=1S/C21H18BFN2O5S/c23-16-6-8-17(9-7-16)25(12-20(26)27)21(28)14-5-10-19(24-11-14)31-13-15-3-1-2-4-18(15)22(29)30/h1-11,29-30H,12-13H2,(H,26,27)
Reactome pathway
n/an/a 1.99E+3n/an/an/an/an/an/a
Syntrix Biosystems
Curated by ChEMBL
Assay Description
Antagonist activity at CXCR2 in human PMNs assessed as inhibition of CXCL1-induced intracellular Ca2+ release by fluorescence based calcium flux assa...
J Med Chem 57: 8378-97 (2014)
Article DOI: 10.1021/jm500827t
BindingDB Entry DOI: 10.7270/Q2FX7C22