BDBM150974 US8981106, 164
SMILES: OB(O)c1ccccc1CSc1ccc(cn1)C(=O)Nc1ccc(F)cn1
InChI Key: InChIKey=CQAOKXRBQNAENA-UHFFFAOYSA-N
Data: 2 IC50
Activity Spreadsheet -- Enzyme Inhibition Constant Data from BindingDB
Found 2 hits for monomerid = 150974
Trg + Lig
Ki
nM
ΔG°
kcal/mole
IC50
nM
Kd
nM
EC50/IC50
nM
koff
s-1
kon
M-1s-1
pHTemp
°C
C-X-C chemokine receptor type 2
(Homo sapiens (Human))
BDBM150974
(US8981106, 164)
Show SMILES OB(O)c1ccccc1CSc1ccc(cn1)C(=O)Nc1ccc(F)cn1
Show InChI InChI=1S/C18H15BFN3O3S/c20-14-6-7-16(21-10-14)23-18(24)12-5-8-17(22-9-12)27-11-13-3-1-2-4-15(13)19(25)26/h1-10,25-26H,11H2,(H,21,23,24)
Reactome pathway
n/an/a 294n/an/an/an/an/an/a
Syntrix Biosystems
Curated by ChEMBL
Assay Description
Antagonist activity at CXCR2 in human PMNs assessed as inhibition of CXCL1-induced intracellular Ca2+ release by fluorescence based calcium flux assa...
J Med Chem 57: 8378-97 (2014)
Article DOI: 10.1021/jm500827t
BindingDB Entry DOI: 10.7270/Q2FX7C22
C-X-C chemokine receptor type 2
(Homo sapiens (Human))
BDBM150974
(US8981106, 164)
Show SMILES OB(O)c1ccccc1CSc1ccc(cn1)C(=O)Nc1ccc(F)cn1
Show InChI InChI=1S/C18H15BFN3O3S/c20-14-6-7-16(21-10-14)23-18(24)12-5-8-17(22-9-12)27-11-13-3-1-2-4-15(13)19(25)26/h1-10,25-26H,11H2,(H,21,23,24)
Reactome pathway
US Patent
n/an/a 294n/an/an/an/an/a37
Syntrix Biosystems, Inc.
US Patent
Assay Description
An in vitro assay showed inhibition of CXCR2-mediated intracellular calcium release. Briefly, human neutrophils were suspended in HBSS- (without Ca2+...
US Patent US8981106 (2015)
BindingDB Entry DOI: 10.7270/Q2WW7GC1