BDBM150977 US8981106, 157
SMILES: OB(O)c1ccccc1CSc1ccc(cn1)C(=O)N(Cc1ccncc1)c1ccc(F)cc1
InChI Key: InChIKey=GIMJASCDJDQTCG-UHFFFAOYSA-N
Data: 2 IC50
Activity Spreadsheet -- Enzyme Inhibition Constant Data from BindingDB
Found 2 hits for monomerid = 150977
Trg + Lig
Ki
nM
ΔG°
kcal/mole
IC50
nM
Kd
nM
EC50/IC50
nM
koff
s-1
kon
M-1s-1
pHTemp
°C
C-X-C chemokine receptor type 2
(Homo sapiens (Human))
BDBM150977
(US8981106, 157)
Show SMILES OB(O)c1ccccc1CSc1ccc(cn1)C(=O)N(Cc1ccncc1)c1ccc(F)cc1
Show InChI InChI=1S/C25H21BFN3O3S/c27-21-6-8-22(9-7-21)30(16-18-11-13-28-14-12-18)25(31)19-5-10-24(29-15-19)34-17-20-3-1-2-4-23(20)26(32)33/h1-15,32-33H,16-17H2
Reactome pathway
n/an/a 890n/an/an/an/an/an/a
Syntrix Biosystems
Curated by ChEMBL
Assay Description
Antagonist activity at CXCR2 in human PMNs assessed as inhibition of CXCL1-induced intracellular Ca2+ release by fluorescence based calcium flux assa...
J Med Chem 57: 8378-97 (2014)
Article DOI: 10.1021/jm500827t
BindingDB Entry DOI: 10.7270/Q2FX7C22
C-X-C chemokine receptor type 2
(Homo sapiens (Human))
BDBM150977
(US8981106, 157)
Show SMILES OB(O)c1ccccc1CSc1ccc(cn1)C(=O)N(Cc1ccncc1)c1ccc(F)cc1
Show InChI InChI=1S/C25H21BFN3O3S/c27-21-6-8-22(9-7-21)30(16-18-11-13-28-14-12-18)25(31)19-5-10-24(29-15-19)34-17-20-3-1-2-4-23(20)26(32)33/h1-15,32-33H,16-17H2
Reactome pathway
US Patent
n/an/a 890n/an/an/an/an/a37
Syntrix Biosystems, Inc.
US Patent
Assay Description
An in vitro assay showed inhibition of CXCR2-mediated intracellular calcium release. Briefly, human neutrophils were suspended in HBSS- (without Ca2+...
US Patent US8981106 (2015)
BindingDB Entry DOI: 10.7270/Q2WW7GC1