null
SMILES: OB(O)c1ccccc1COc1ccc(cn1)C(=O)Nc1ccc(F)cn1
InChI Key: InChIKey=OMLWVSYYUIQLKM-UHFFFAOYSA-N
Activity Spreadsheet -- Enzyme Inhibition Constant Data from BindingDB
Found 1 hit for monomerid = 150979
Trg + Lig
Ki
nM
ΔG°
kcal/mole
IC50
nM
Kd
nM
EC50/IC50
nM
koff
s-1
kon
M-1s-1
pHTemp
°C
C-X-C chemokine receptor type 2
(Homo sapiens (Human))
BDBM150979
(US8981106, 168)
Show SMILES OB(O)c1ccccc1COc1ccc(cn1)C(=O)Nc1ccc(F)cn1
Show InChI InChI=1S/C18H15BFN3O4/c20-14-6-7-16(21-10-14)23-18(24)12-5-8-17(22-9-12)27-11-13-3-1-2-4-15(13)19(25)26/h1-10,25-26H,11H2,(H,21,23,24)
Reactome pathway
US Patent
n/an/a 32n/an/an/an/an/a37
Syntrix Biosystems, Inc.
US Patent
Assay Description
An in vitro assay showed inhibition of CXCR2-mediated intracellular calcium release. Briefly, human neutrophils were suspended in HBSS- (without Ca2+...
US Patent US8981106 (2015)
BindingDB Entry DOI: 10.7270/Q2WW7GC1