BDBM151241 US8987314, B37
SMILES: CS(=O)(=O)C(C(=O)NCCS(N)(=O)=O)c1nc2ccc(cc2s1)-c1cccc(F)c1
InChI Key: InChIKey=CBHIJQUOYVXBOA-UHFFFAOYSA-N
Data: 2 IC50
Activity Spreadsheet -- Enzyme Inhibition Constant Data from BindingDB
Found 2 hits for monomerid = 151241
Trg + Lig
Ki
nM
ΔG°
kcal/mole
IC50
nM
Kd
nM
EC50/IC50
nM
koff
s-1
kon
M-1s-1
pHTemp
°C
Hepatic triacylglycerol lipase
(Homo sapiens (Human))
BDBM151241
(US8987314, B37)
Show SMILES CS(=O)(=O)C(C(=O)NCCS(N)(=O)=O)c1nc2ccc(cc2s1)-c1cccc(F)c1
Show InChI InChI=1S/C18H18FN3O5S3/c1-29(24,25)16(17(23)21-7-8-30(20,26)27)18-22-14-6-5-12(10-15(14)28-18)11-3-2-4-13(19)9-11/h2-6,9-10,16H,7-8H2,1H3,(H,21,23)(H2,20,26,27)
US Patent
n/an/a<10n/an/an/an/a8.025
Bristol-Myers Squibb Company
US Patent
Assay Description
Endothelial lipase (EL) and hepatic lipase (HL) activities were measured using a fluorescent substrate, A10070, (Invitrogen, CA) doped into an artifi...
US Patent US8987314 (2015)
BindingDB Entry DOI: 10.7270/Q2W094N8
Endothelial lipase
(Homo sapiens (Human))
BDBM151241
(US8987314, B37)
Show SMILES CS(=O)(=O)C(C(=O)NCCS(N)(=O)=O)c1nc2ccc(cc2s1)-c1cccc(F)c1
Show InChI InChI=1S/C18H18FN3O5S3/c1-29(24,25)16(17(23)21-7-8-30(20,26)27)18-22-14-6-5-12(10-15(14)28-18)11-3-2-4-13(19)9-11/h2-6,9-10,16H,7-8H2,1H3,(H,21,23)(H2,20,26,27)
US Patent
n/an/a<10n/an/an/an/a8.025
Bristol-Myers Squibb Company
US Patent
Assay Description
Endothelial lipase (EL) and hepatic lipase (HL) activities were measured using a fluorescent substrate, A10070, (Invitrogen, CA) doped into an artifi...
US Patent US8987314 (2015)
BindingDB Entry DOI: 10.7270/Q2W094N8