null
SMILES: CS(=O)(=O)C(C(=O)NCCS(N)(=O)=O)c1nc2ccc(cc2s1)-c1ccc(OCCN2CCOCC2)cc1
InChI Key: InChIKey=LKKVFPLANIPPOB-UHFFFAOYSA-N
Activity Spreadsheet -- Enzyme Inhibition Constant Data from BindingDB
Found 2 hits for monomerid = 151246
Trg + Lig
Ki
nM
ΔG°
kcal/mole
IC50
nM
Kd
nM
EC50/IC50
nM
koff
s-1
kon
M-1s-1
pHTemp
°C
Hepatic triacylglycerol lipase
(Homo sapiens (Human))
BDBM151246
(US8987314, B42)
Show SMILES CS(=O)(=O)C(C(=O)NCCS(N)(=O)=O)c1nc2ccc(cc2s1)-c1ccc(OCCN2CCOCC2)cc1
Show InChI InChI=1S/C24H30N4O7S3/c1-37(30,31)22(23(29)26-8-15-38(25,32)33)24-27-20-7-4-18(16-21(20)36-24)17-2-5-19(6-3-17)35-14-11-28-9-12-34-13-10-28/h2-7,16,22H,8-15H2,1H3,(H,26,29)(H2,25,32,33)
US Patent
n/an/a 10n/an/an/an/a8.025
Bristol-Myers Squibb Company
US Patent
Assay Description
Endothelial lipase (EL) and hepatic lipase (HL) activities were measured using a fluorescent substrate, A10070, (Invitrogen, CA) doped into an artifi...
US Patent US8987314 (2015)
BindingDB Entry DOI: 10.7270/Q2W094N8
Endothelial lipase
(Homo sapiens (Human))
BDBM151246
(US8987314, B42)
Show SMILES CS(=O)(=O)C(C(=O)NCCS(N)(=O)=O)c1nc2ccc(cc2s1)-c1ccc(OCCN2CCOCC2)cc1
Show InChI InChI=1S/C24H30N4O7S3/c1-37(30,31)22(23(29)26-8-15-38(25,32)33)24-27-20-7-4-18(16-21(20)36-24)17-2-5-19(6-3-17)35-14-11-28-9-12-34-13-10-28/h2-7,16,22H,8-15H2,1H3,(H,26,29)(H2,25,32,33)
US Patent
n/an/a<10n/an/an/an/a8.025
Bristol-Myers Squibb Company
US Patent
Assay Description
Endothelial lipase (EL) and hepatic lipase (HL) activities were measured using a fluorescent substrate, A10070, (Invitrogen, CA) doped into an artifi...
US Patent US8987314 (2015)
BindingDB Entry DOI: 10.7270/Q2W094N8