BDBM15134 5-indazolyl pyridine 11c::5-{5-[(2S)-2-amino-3-(naphthalen-2-yl)propoxy]pyridin-3-yl}-3-methyl-1H-indazole
SMILES: Cc1n[nH]c2ccc(cc12)-c1cncc(OC[C@@H](N)Cc2ccc3ccccc3c2)c1
InChI Key: InChIKey=MERRRAMHGZHLJY-QHCPKHFHSA-N
Data: 1 KI
PDB links: 3 PDB IDs contain inhibitors having a similarity of 90% to this monomer.
Activity Spreadsheet -- Enzyme Inhibition Constant Data from BindingDB
Found 1 hit for monomerid = 15134
Trg + Lig
Ki
nM
ΔG°
kcal/mole
IC50
nM
Kd
nM
EC50/IC50
nM
koff
s-1
kon
M-1s-1
pHTemp
°C
Protein kinase B (Akt 1)
(Homo sapiens (Human))
BDBM15134
(5-indazolyl pyridine 11c | 5-{5-[(2S)-2-amino-3-(n...)
Show SMILES Cc1n[nH]c2ccc(cc12)-c1cncc(OC[C@@H](N)Cc2ccc3ccccc3c2)c1 |r|
Show InChI InChI=1S/C26H24N4O/c1-17-25-13-21(8-9-26(25)30-29-17)22-12-24(15-28-14-22)31-16-23(27)11-18-6-7-19-4-2-3-5-20(19)10-18/h2-10,12-15,23H,11,16,27H2,1H3,(H,29,30)/t23-/m0/s1
3.20 -11.5n/an/an/an/an/a7.522
Abbott Laboratories
Assay Description
The kinase assay uses His-Akt1 and a biotinylated peptide as substrate. The biotinylated peptides were immobilized on streptavidin-coated FLASH plat...
Bioorg Med Chem Lett 16: 3740-4 (2006)
Article DOI: 10.1016/j.bmcl.2006.04.046
BindingDB Entry DOI: 10.7270/Q2ZP44C9