BDBM15135 5-indazolyl pyridine 11d::5-{5-[(2S)-2-amino-3-(naphthalen-1-yl)propoxy]pyridin-3-yl}-3-methyl-1H-indazole
SMILES: Cc1n[nH]c2ccc(cc12)-c1cncc(OC[C@@H](N)Cc2cccc3ccccc23)c1
InChI Key: InChIKey=OVRDDZHIRBTAAC-QFIPXVFZSA-N
Data: 1 KI
PDB links: 3 PDB IDs contain inhibitors having a similarity of 90% to this monomer.
Activity Spreadsheet -- Enzyme Inhibition Constant Data from BindingDB
Found 1 hit for monomerid = 15135
Trg + Lig
Ki
nM
ΔG°
kcal/mole
IC50
nM
Kd
nM
EC50/IC50
nM
koff
s-1
kon
M-1s-1
pHTemp
°C
Protein kinase B (Akt 1)
(Homo sapiens (Human))
BDBM15135
(5-indazolyl pyridine 11d | 5-{5-[(2S)-2-amino-3-(n...)
Show SMILES Cc1n[nH]c2ccc(cc12)-c1cncc(OC[C@@H](N)Cc2cccc3ccccc23)c1 |r|
Show InChI InChI=1S/C26H24N4O/c1-17-25-13-19(9-10-26(25)30-29-17)21-12-23(15-28-14-21)31-16-22(27)11-20-7-4-6-18-5-2-3-8-24(18)20/h2-10,12-15,22H,11,16,27H2,1H3,(H,29,30)/t22-/m0/s1
8.30 -10.9n/an/an/an/an/a7.522
Abbott Laboratories
Assay Description
The kinase assay uses His-Akt1 and a biotinylated peptide as substrate. The biotinylated peptides were immobilized on streptavidin-coated FLASH plat...
Bioorg Med Chem Lett 16: 3740-4 (2006)
Article DOI: 10.1016/j.bmcl.2006.04.046
BindingDB Entry DOI: 10.7270/Q2ZP44C9