BDBM15139 5-indazolyl pyridine 11h::5-{5-[(2S)-2-amino-3-(pyridin-4-yl)propoxy]pyridin-3-yl}-3-methyl-1H-indazole
SMILES: Cc1n[nH]c2ccc(cc12)-c1cncc(OC[C@@H](N)Cc2ccncc2)c1
InChI Key: InChIKey=UUZUQAMMGJUOQF-SFHVURJKSA-N
Data: 1 KI
PDB links: 3 PDB IDs contain inhibitors having a similarity of 90% to this monomer.
Activity Spreadsheet -- Enzyme Inhibition Constant Data from BindingDB
Found 1 hit for monomerid = 15139
Trg + Lig
Ki
nM
ΔG°
kcal/mole
IC50
nM
Kd
nM
EC50/IC50
nM
koff
s-1
kon
M-1s-1
pHTemp
°C
Protein kinase B (Akt 1)
(Homo sapiens (Human))
BDBM15139
(5-indazolyl pyridine 11h | 5-{5-[(2S)-2-amino-3-(p...)
Show SMILES Cc1n[nH]c2ccc(cc12)-c1cncc(OC[C@@H](N)Cc2ccncc2)c1 |r|
Show InChI InChI=1S/C21H21N5O/c1-14-20-10-16(2-3-21(20)26-25-14)17-9-19(12-24-11-17)27-13-18(22)8-15-4-6-23-7-5-15/h2-7,9-12,18H,8,13,22H2,1H3,(H,25,26)/t18-/m0/s1
3.28E+3 -7.40n/an/an/an/an/a7.522
Abbott Laboratories
Assay Description
The kinase assay uses His-Akt1 and a biotinylated peptide as substrate. The biotinylated peptides were immobilized on streptavidin-coated FLASH plat...
Bioorg Med Chem Lett 16: 3740-4 (2006)
Article DOI: 10.1016/j.bmcl.2006.04.046
BindingDB Entry DOI: 10.7270/Q2ZP44C9