BDBM151572 US8987314, B383
SMILES: CS(=O)(=O)C(C(=O)NCCS(N)(=O)=O)c1nc2cc(ccc2s1)-c1cccnc1F
InChI Key: InChIKey=KOJRMPQAIJQJQG-UHFFFAOYSA-N
Data: 2 IC50
Activity Spreadsheet -- Enzyme Inhibition Constant Data from BindingDB
Found 2 hits for monomerid = 151572
Trg + Lig
Ki
nM
ΔG°
kcal/mole
IC50
nM
Kd
nM
EC50/IC50
nM
koff
s-1
kon
M-1s-1
pHTemp
°C
Hepatic Lipase (HL)
(Homo sapiens (Human))
BDBM151572
(US8987314, B383)
Show SMILES CS(=O)(=O)C(C(=O)NCCS(N)(=O)=O)c1nc2cc(ccc2s1)-c1cccnc1F
Show InChI InChI=1S/C17H17FN4O5S3/c1-29(24,25)14(16(23)21-7-8-30(19,26)27)17-22-12-9-10(4-5-13(12)28-17)11-3-2-6-20-15(11)18/h2-6,9,14H,7-8H2,1H3,(H,21,23)(H2,19,26,27)
US Patent
n/an/a 13n/an/an/an/a8.025
Bristol-Myers Squibb Company
US Patent
Assay Description
Endothelial lipase (EL) and hepatic lipase (HL) activities were measured using a fluorescent substrate, A10070, (Invitrogen, CA) doped into an artifi...
US Patent US8987314 (2015)
BindingDB Entry DOI: 10.7270/Q2W094N8
Endothelial lipase
(Homo sapiens (Human))
BDBM151572
(US8987314, B383)
Show SMILES CS(=O)(=O)C(C(=O)NCCS(N)(=O)=O)c1nc2cc(ccc2s1)-c1cccnc1F
Show InChI InChI=1S/C17H17FN4O5S3/c1-29(24,25)14(16(23)21-7-8-30(19,26)27)17-22-12-9-10(4-5-13(12)28-17)11-3-2-6-20-15(11)18/h2-6,9,14H,7-8H2,1H3,(H,21,23)(H2,19,26,27)
US Patent
n/an/a 0.700n/an/an/an/a8.025
Bristol-Myers Squibb Company
US Patent
Assay Description
Endothelial lipase (EL) and hepatic lipase (HL) activities were measured using a fluorescent substrate, A10070, (Invitrogen, CA) doped into an artifi...
US Patent US8987314 (2015)
BindingDB Entry DOI: 10.7270/Q2W094N8