BDBM151622 US8987335, 23
SMILES: C\C(=N/NC(=O)c1cccc(c1)N1CCOCC1)c1cc(Cl)ccc1O
InChI Key: InChIKey=DGRCPUUJHIIGBX-FYJGNVAPSA-N
Data: 2 IC50
Activity Spreadsheet -- Enzyme Inhibition Constant Data from BindingDB
Found 2 hits for monomerid = 151622
Trg + Lig
Ki
nM
ΔG°
kcal/mole
IC50
nM
Kd
nM
EC50/IC50
nM
koff
s-1
kon
M-1s-1
pHTemp
°C
Lysine-specific histone demethylase 1A
(Homo sapiens (Human))
BDBM151622
(US8987335, 23)
Show SMILES C\C(=N/NC(=O)c1cccc(c1)N1CCOCC1)c1cc(Cl)ccc1O
Show InChI InChI=1S/C19H20ClN3O3/c1-13(17-12-15(20)5-6-18(17)24)21-22-19(25)14-3-2-4-16(11-14)23-7-9-26-10-8-23/h2-6,11-12,24H,7-10H2,1H3,(H,22,25)/b21-13+
Reactome pathway
US Patent
n/an/a 519n/an/an/an/an/an/a
University of Utah Research Foundation
US Patent
Assay Description
The primary assay for compound inhibitory activity was the LSD1 Inhibitor Screening Assay Kit (Cayman Chemical Company, Ann Arbor, Mich.; Cayman Chem...
US Patent US9555024 (2017)
BindingDB Entry DOI: 10.7270/Q21R6SH1
Lysine-specific histone demethylase 1A
(Homo sapiens (Human))
BDBM151622
(US8987335, 23)
Show SMILES C\C(=N/NC(=O)c1cccc(c1)N1CCOCC1)c1cc(Cl)ccc1O
Show InChI InChI=1S/C19H20ClN3O3/c1-13(17-12-15(20)5-6-18(17)24)21-22-19(25)14-3-2-4-16(11-14)23-7-9-26-10-8-23/h2-6,11-12,24H,7-10H2,1H3,(H,22,25)/b21-13+
Reactome pathway
US Patent
n/an/a 519n/an/an/an/an/an/a
University of Utah Research Foundation
US Patent
Assay Description
The primary assay for compound inhibitory activity was the LSD1 Inhibitor Screening Assay Kit (Cayman Chemical Company, Ann Arbor, Mich.; Cayman Chem...
US Patent US8987335 (2015)
BindingDB Entry DOI: 10.7270/Q2GQ6WGH