BDBM1519 2-cyclopropyl-5,7-dimethyl-2,4,9,15-tetraazatricyclo[9.4.0.0^{3,8}]pentadeca-1(11),3,5,7,12,14-hexaen-10-one::Dipyridodiazepinone deriv. 4
SMILES: Cc1cc(C)c2NC(=O)c3cccnc3N(C3CC3)c2n1
InChI Key: InChIKey=RUFQBYAUEBPVOC-UHFFFAOYSA-N
Data: 2 IC50
PDB links: 13 PDB IDs contain inhibitors having a similarity of 90% to this monomer.
Activity Spreadsheet -- Enzyme Inhibition Constant Data from BindingDB
Found 2 hits for monomerid = 1519
Trg + Lig
Ki
nM
ΔG°
kcal/mole
IC50
nM
Kd
nM
EC50/IC50
nM
koff
s-1
kon
M-1s-1
pHTemp
°C
HIV-1 Reverse Transcriptase Mutant (Y181C)
(Human immunodeficiency virus type 1)
BDBM1519
(2-cyclopropyl-5,7-dimethyl-2,4,9,15-tetraazatricyc...)
Show SMILES Cc1cc(C)c2NC(=O)c3cccnc3N(C3CC3)c2n1
Show InChI InChI=1S/C16H16N4O/c1-9-8-10(2)18-15-13(9)19-16(21)12-4-3-7-17-14(12)20(15)11-5-6-11/h3-4,7-8,11H,5-6H2,1-2H3,(H,19,21)
n/an/a 1.20E+3n/an/an/an/a7.825
Boehringer Ingelheim Pharmaceuticals Inc.
Assay Description
The IC50 of reverse transcriptase is the concentration that inhibits 50% of recombinant HIV-1 RT RNA-directed DNA polymerase activity in vitro.
J Med Chem 38: 4830-8 (1995)
Article DOI: 10.1021/jm00024a010
BindingDB Entry DOI: 10.7270/Q23B5XBJ
HIV-1 Reverse Transcriptase
(Human immunodeficiency virus type 1)
BDBM1519
(2-cyclopropyl-5,7-dimethyl-2,4,9,15-tetraazatricyc...)
Show SMILES Cc1cc(C)c2NC(=O)c3cccnc3N(C3CC3)c2n1
Show InChI InChI=1S/C16H16N4O/c1-9-8-10(2)18-15-13(9)19-16(21)12-4-3-7-17-14(12)20(15)11-5-6-11/h3-4,7-8,11H,5-6H2,1-2H3,(H,19,21)
n/an/a 70n/an/an/an/a7.825
Boehringer Ingelheim Pharmaceuticals Inc.
Assay Description
The IC50 of reverse transcriptase is the concentration that inhibits 50% of recombinant HIV-1 RT RNA-directed DNA polymerase activity in vitro.
J Med Chem 38: 4830-8 (1995)
Article DOI: 10.1021/jm00024a010
BindingDB Entry DOI: 10.7270/Q23B5XBJ