BDBM15243 1-(2,6-dichlorophenyl)-6-[(2,4-difluorophenyl)sulfanyl]-7-(1,2,3,6-tetrahydropyridin-4-yl)-1H,2H,3H,4H-pyrido[3,2-d]pyrimidin-2-one::10-(2,6-dichlorophenyl)-4-(2,4-difluorophenyl)sulfanyl-3-(1,2,3,6-tetrahydropyridin-4-yl)-5,8,10-triazabicyclo[4.4.0]deca-2,4,7,11-tetraen-9-one::pyridol-pyrimidine compound 4
SMILES: Fc1ccc(Sc2nc3CNC(=O)N(c3cc2C2=CCNCC2)c2c(Cl)cccc2Cl)c(F)c1
InChI Key: InChIKey=PZUXNWPJBLCJKB-UHFFFAOYSA-N
Data: 3 IC50
PDB links: 1 PDB ID matches this monomer.
Activity Spreadsheet -- Enzyme Inhibition Constant Data from BindingDB
Found 3 hits for monomerid = 15243
Trg + Lig
Ki
nM
ΔG°
kcal/mole
IC50
nM
Kd
nM
EC50/IC50
nM
koff
s-1
kon
M-1s-1
pHTemp
°C
MAP kinase p38
(Mus musculus (mouse))
BDBM15243
(1-(2,6-dichlorophenyl)-6-[(2,4-difluorophenyl)sulf...)
Show SMILES Fc1ccc(Sc2nc3CNC(=O)N(c3cc2C2=CCNCC2)c2c(Cl)cccc2Cl)c(F)c1 |t:19|
Show InChI InChI=1S/C24H18Cl2F2N4OS/c25-16-2-1-3-17(26)22(16)32-20-11-15(13-6-8-29-9-7-13)23(31-19(20)12-30-24(32)33)34-21-5-4-14(27)10-18(21)28/h1-6,10-11,29H,7-9,12H2,(H,30,33)
Reactome pathway
n/an/a 4.30n/an/an/an/a7.030
Merck Research Laboratories
Assay Description
The biochemical activity of compounds was determined by incubation with wild-type or mutant p38alpha enzymes, and substrates in the presence ATP/[gam...
Nat Struct Biol 10: 764-9 (2003)
Article DOI: 10.1038/nsb949
BindingDB Entry DOI: 10.7270/Q2SX6BF9
3D
3D Structure (crystal)
MAP Kinase p38 alpha Mutant (G110D)
(Mus musculus (mouse))
BDBM15243
(1-(2,6-dichlorophenyl)-6-[(2,4-difluorophenyl)sulf...)
Show SMILES Fc1ccc(Sc2nc3CNC(=O)N(c3cc2C2=CCNCC2)c2c(Cl)cccc2Cl)c(F)c1 |t:19|
Show InChI InChI=1S/C24H18Cl2F2N4OS/c25-16-2-1-3-17(26)22(16)32-20-11-15(13-6-8-29-9-7-13)23(31-19(20)12-30-24(32)33)34-21-5-4-14(27)10-18(21)28/h1-6,10-11,29H,7-9,12H2,(H,30,33)
n/an/a 160n/an/an/an/a7.030
Merck Research Laboratories
Assay Description
The biochemical activity of compounds was determined by incubation with wild-type or mutant p38alpha enzymes, and substrates in the presence ATP/[gam...
Nat Struct Biol 10: 764-9 (2003)
Article DOI: 10.1038/nsb949
BindingDB Entry DOI: 10.7270/Q2SX6BF9
3D
3D Structure (crystal)
MAP Kinase p38 alpha Mutant (G110A)
(Mus musculus (mouse))
BDBM15243
(1-(2,6-dichlorophenyl)-6-[(2,4-difluorophenyl)sulf...)
Show SMILES Fc1ccc(Sc2nc3CNC(=O)N(c3cc2C2=CCNCC2)c2c(Cl)cccc2Cl)c(F)c1 |t:19|
Show InChI InChI=1S/C24H18Cl2F2N4OS/c25-16-2-1-3-17(26)22(16)32-20-11-15(13-6-8-29-9-7-13)23(31-19(20)12-30-24(32)33)34-21-5-4-14(27)10-18(21)28/h1-6,10-11,29H,7-9,12H2,(H,30,33)
n/an/a 61n/an/an/an/a7.030
Merck Research Laboratories
Assay Description
The biochemical activity of compounds was determined by incubation with wild-type or mutant p38alpha enzymes, and substrates in the presence ATP/[gam...
Nat Struct Biol 10: 764-9 (2003)
Article DOI: 10.1038/nsb949
BindingDB Entry DOI: 10.7270/Q2SX6BF9
3D
3D Structure (crystal)