BDBM152551 Dimer 15 (15)
SMILES: OC1[C@@H](CNC(=O)CNC(=O)CCC(=O)NCC(=O)NC[C@H]2O[C@H]([C@@H](O)C2O)n2ccc(=O)[nH]c2=O)O[C@H]([C@H]1O)n1ccc(=O)[nH]c1=O
InChI Key:
Data: 1 IC50
Activity Spreadsheet -- Enzyme Inhibition Constant Data from BindingDB
Found 1 hit for monomerid = 152551
Trg + Lig
Ki
nM
ΔG°
kcal/mole
IC50
nM
Kd
nM
EC50/IC50
nM
koff
s-1
kon
M-1s-1
pHTemp
°C
Chitin synthase (CS)
(Saccharomyces cerevisiae (Yeast))
BDBM152551
(Dimer 15 (15))
Show SMILES OC1[C@@H](CNC(=O)CNC(=O)CCC(=O)NCC(=O)NC[C@H]2O[C@H]([C@@H](O)C2O)n2ccc(=O)[nH]c2=O)O[C@H]([C@H]1O)n1ccc(=O)[nH]c1=O |r|
n/an/a 3.00E+6n/an/an/an/a7.525
Silesian University of Technology
Assay Description
Assays were performed in 96-wells microtiter plate with flat bottom. To each well of the plate, 100 µL of WGA solution was added at 50 µg/mL. After i...
Bioorg Chem 61: 13-20 (2015)
Article DOI: 10.1016/j.bioorg.2015.05.007
BindingDB Entry DOI: 10.7270/Q2S1817P