BDBM152910 US8993586, 106
SMILES: CC(C)(C)n1cc2CC3(CCN(CC3)C(=O)c3ccc4ccc(NC5CC5)nc4c3)NC(=O)c2n1
InChI Key: InChIKey=SPRFYBBZMRUTBH-UHFFFAOYSA-N
Data: 2 IC50
Activity Spreadsheet -- Enzyme Inhibition Constant Data from BindingDB
Found 2 hits for monomerid = 152910
Trg + Lig
Ki
nM
ΔG°
kcal/mole
IC50
nM
Kd
nM
EC50/IC50
nM
koff
s-1
kon
M-1s-1
pHTemp
°C
Acetyl-CoA carboxylase 2 (ACC2)
(Homo sapiens (Human))
BDBM152910
(US8993586, 106)
Show SMILES CC(C)(C)n1cc2CC3(CCN(CC3)C(=O)c3ccc4ccc(NC5CC5)nc4c3)NC(=O)c2n1
Show InChI InChI=1S/C27H32N6O2/c1-26(2,3)33-16-19-15-27(30-24(34)23(19)31-33)10-12-32(13-11-27)25(35)18-5-4-17-6-9-22(28-20-7-8-20)29-21(17)14-18/h4-6,9,14,16,20H,7-8,10-13,15H2,1-3H3,(H,28,29)(H,30,34)
Reactome pathway
US Patent
n/an/a 2.60n/an/an/an/an/an/a
Pfizer Inc.
US Patent
Assay Description
Preparation of rhACC2. Human ACC2 inhibition was measured using purified recombinant human ACC2 (hrACC2). Briefly, a full length Cytomax clone of ACC...
US Patent US8993586 (2015)
BindingDB Entry DOI: 10.7270/Q2N58K43
Acetyl-CoA carboxylase 1 (ACC1)
(Homo sapiens (Human))
BDBM152910
(US8993586, 106)
Show SMILES CC(C)(C)n1cc2CC3(CCN(CC3)C(=O)c3ccc4ccc(NC5CC5)nc4c3)NC(=O)c2n1
Show InChI InChI=1S/C27H32N6O2/c1-26(2,3)33-16-19-15-27(30-24(34)23(19)31-33)10-12-32(13-11-27)25(35)18-5-4-17-6-9-22(28-20-7-8-20)29-21(17)14-18/h4-6,9,14,16,20H,7-8,10-13,15H2,1-3H3,(H,28,29)(H,30,34)
US Patent
n/an/a 7.5n/an/an/an/a7.5n/a
Pfizer Inc.
US Patent
Assay Description
Preparation of rhACC1. Two liters of SF9 cells, infected with recombinant baculovirus containing full length human ACC1 cDNA, were suspended in ice-c...
US Patent US8993586 (2015)
BindingDB Entry DOI: 10.7270/Q2N58K43