BDBM15302 (5R)-6-{4-[(2-benzyl-3-oxocyclohex-1-en-1-yl)amino]phenyl}-5-methyl-2,3,4,5-tetrahydropyridazin-3-one::dihydropyridazinone 8a
SMILES: C[C@@H]1CC(=O)NN=C1c1ccc(NC2=C(Cc3ccccc3)C(=O)CCC2)cc1
InChI Key: InChIKey=XQZBNVDKOIEJHQ-MRXNPFEDSA-N
Data: 2 IC50
PDB links: 1 PDB ID contains this monomer as substructures. 1 PDB ID contains inhibitors having a similarity of 90% to this monomer.
Activity Spreadsheet -- Enzyme Inhibition Constant Data from BindingDB
Found 2 hits for monomerid = 15302
Trg + Lig
Ki
nM
ΔG°
kcal/mole
IC50
nM
Kd
nM
EC50/IC50
nM
koff
s-1
kon
M-1s-1
pHTemp
°C
Phosphodiesterase Type 3 (PDE3A)
(Homo sapiens (Human))
BDBM15302
((5R)-6-{4-[(2-benzyl-3-oxocyclohex-1-en-1-yl)amino...)
Show SMILES C[C@@H]1CC(=O)NN=C1c1ccc(NC2=C(Cc3ccccc3)C(=O)CCC2)cc1 |r,c:6,14|
Show InChI InChI=1S/C24H25N3O2/c1-16-14-23(29)26-27-24(16)18-10-12-19(13-11-18)25-21-8-5-9-22(28)20(21)15-17-6-3-2-4-7-17/h2-4,6-7,10-13,16,25H,5,8-9,14-15H2,1H3,(H,26,29)/t16-/m1/s1
n/an/a 1.30n/an/an/an/an/an/a
Merck Research Laboratories
Assay Description
PDE activity was monitored by measuring the hydrolysis of [3H]-cAMP to [3H]-AMP using scintillation proximity assay (SPA). [3H]-AMP was captured by t...
Bioorg Med Chem Lett 13: 3983-7 (2003)
Article DOI: 10.1016/j.bmcl.2003.08.056
BindingDB Entry DOI: 10.7270/Q2JD4V11
Phosphodiesterase Type 3 (PDE3B)
(Homo sapiens (Human))
BDBM15302
((5R)-6-{4-[(2-benzyl-3-oxocyclohex-1-en-1-yl)amino...)
Show SMILES C[C@@H]1CC(=O)NN=C1c1ccc(NC2=C(Cc3ccccc3)C(=O)CCC2)cc1 |r,c:6,14|
Show InChI InChI=1S/C24H25N3O2/c1-16-14-23(29)26-27-24(16)18-10-12-19(13-11-18)25-21-8-5-9-22(28)20(21)15-17-6-3-2-4-7-17/h2-4,6-7,10-13,16,25H,5,8-9,14-15H2,1H3,(H,26,29)/t16-/m1/s1
n/an/a 0.190n/an/an/an/a7.522
Merck Research Laboratories
Assay Description
PDE activity was monitored by measuring the hydrolysis of [3H]-cAMP to [3H]-AMP using scintillation proximity assay (SPA). [3H]-AMP was captured by t...
Bioorg Med Chem Lett 13: 3983-7 (2003)
Article DOI: 10.1016/j.bmcl.2003.08.056
BindingDB Entry DOI: 10.7270/Q2JD4V11
3D
3D Structure (docked)