null
SMILES: CCOC(=O)c1c[nH]c2ncnc(-c3ccc(Cl)c(NC(=O)C(C)=C)c3)c12
InChI Key: InChIKey=QUKHFUFVEMVHSX-UHFFFAOYSA-N
Activity Spreadsheet -- Enzyme Inhibition Constant Data from BindingDB
Found 2 hits for monomerid = 153166
Trg + Lig
Ki
nM
ΔG°
kcal/mole
IC50
nM
Kd
nM
EC50/IC50
nM
koff
s-1
kon
M-1s-1
pHTemp
°C
Tyrosine-protein kinase JAK2
(Homo sapiens (Human))
BDBM153166
(US8993756, 4-9)
Show SMILES CCOC(=O)c1c[nH]c2ncnc(-c3ccc(Cl)c(NC(=O)C(C)=C)c3)c12
Show InChI InChI=1S/C19H17ClN4O3/c1-4-27-19(26)12-8-21-17-15(12)16(22-9-23-17)11-5-6-13(20)14(7-11)24-18(25)10(2)3/h5-9H,2,4H2,1,3H3,(H,24,25)(H,21,22,23)
Reactome pathway
US Patent
n/an/a>1.50E+3n/an/an/an/an/a25
Merck Sharp & Dohme Corp.
US Patent
Assay Description
The ability of compounds to inhibit the activity of JAKl, JAK2, JAK3, and Tyk2 was measured using a recombinant purified GST-tagged catalytic domain ...
US Patent US8993756 (2015)
BindingDB Entry DOI: 10.7270/Q2VQ31DJ
Tyrosine-protein kinase JAK3
(Homo sapiens (Human))
BDBM153166
(US8993756, 4-9)
Show SMILES CCOC(=O)c1c[nH]c2ncnc(-c3ccc(Cl)c(NC(=O)C(C)=C)c3)c12
Show InChI InChI=1S/C19H17ClN4O3/c1-4-27-19(26)12-8-21-17-15(12)16(22-9-23-17)11-5-6-13(20)14(7-11)24-18(25)10(2)3/h5-9H,2,4H2,1,3H3,(H,24,25)(H,21,22,23)
Reactome pathway
US Patent
n/an/a 0.0130n/an/an/an/an/a25
Merck Sharp & Dohme Corp.
US Patent
Assay Description
The ability of compounds to inhibit the activity of JAKl, JAK2, JAK3, and Tyk2 was measured using a recombinant purified GST-tagged catalytic domain ...
US Patent US8993756 (2015)
BindingDB Entry DOI: 10.7270/Q2VQ31DJ