BDBM153182 US8993756, 4-27
SMILES: CCOC(=O)c1c[nH]c2ncnc(-c3ccc(C#N)c(NC(=O)C(C)=C)c3)c12
InChI Key: InChIKey=DKMUBTFAPQAKGW-UHFFFAOYSA-N
Data: 2 IC50
Activity Spreadsheet -- Enzyme Inhibition Constant Data from BindingDB
Found 2 hits for monomerid = 153182
Trg + Lig
Ki
nM
ΔG°
kcal/mole
IC50
nM
Kd
nM
EC50/IC50
nM
koff
s-1
kon
M-1s-1
pHTemp
°C
Tyrosine-protein kinase JAK2
(Homo sapiens (Human))
BDBM153182
(US8993756, 4-27)
Show SMILES CCOC(=O)c1c[nH]c2ncnc(-c3ccc(C#N)c(NC(=O)C(C)=C)c3)c12
Show InChI InChI=1S/C20H17N5O3/c1-4-28-20(27)14-9-22-18-16(14)17(23-10-24-18)12-5-6-13(8-21)15(7-12)25-19(26)11(2)3/h5-7,9-10H,2,4H2,1,3H3,(H,25,26)(H,22,23,24)
Reactome pathway
US Patent
n/an/a>1.50E+3n/an/an/an/an/a25
Merck Sharp & Dohme Corp.
US Patent
Assay Description
The ability of compounds to inhibit the activity of JAKl, JAK2, JAK3, and Tyk2 was measured using a recombinant purified GST-tagged catalytic domain ...
US Patent US8993756 (2015)
BindingDB Entry DOI: 10.7270/Q2VQ31DJ
Tyrosine-protein kinase JAK3
(Homo sapiens (Human))
BDBM153182
(US8993756, 4-27)
Show SMILES CCOC(=O)c1c[nH]c2ncnc(-c3ccc(C#N)c(NC(=O)C(C)=C)c3)c12
Show InChI InChI=1S/C20H17N5O3/c1-4-28-20(27)14-9-22-18-16(14)17(23-10-24-18)12-5-6-13(8-21)15(7-12)25-19(26)11(2)3/h5-7,9-10H,2,4H2,1,3H3,(H,25,26)(H,22,23,24)
Reactome pathway
US Patent
n/an/a 0.140n/an/an/an/an/a25
Merck Sharp & Dohme Corp.
US Patent
Assay Description
The ability of compounds to inhibit the activity of JAKl, JAK2, JAK3, and Tyk2 was measured using a recombinant purified GST-tagged catalytic domain ...
US Patent US8993756 (2015)
BindingDB Entry DOI: 10.7270/Q2VQ31DJ