BDBM153219 US8993756, 18-1
SMILES: CCOC(=O)c1c[nH]c2ncnc(-c3cccc(NC(=O)C4(C)CO4)c3)c12
InChI Key:
Data: 2 IC50
Activity Spreadsheet -- Enzyme Inhibition Constant Data from BindingDB
Found 2 hits for monomerid = 153219
Trg + Lig
Ki
nM
ΔG°
kcal/mole
IC50
nM
Kd
nM
EC50/IC50
nM
koff
s-1
kon
M-1s-1
pHTemp
°C
Tyrosine-protein kinase JAK2
(Homo sapiens (Human))
BDBM153219
(US8993756, 18-1)
Show SMILES CCOC(=O)c1c[nH]c2ncnc(-c3cccc(NC(=O)C4(C)CO4)c3)c12
Reactome pathway
US Patent
n/an/a>1.50E+3n/an/an/an/an/a25
Merck Sharp & Dohme Corp.
US Patent
Assay Description
The ability of compounds to inhibit the activity of JAKl, JAK2, JAK3, and Tyk2 was measured using a recombinant purified GST-tagged catalytic domain ...
US Patent US8993756 (2015)
BindingDB Entry DOI: 10.7270/Q2VQ31DJ
Tyrosine-protein kinase JAK3
(Homo sapiens (Human))
BDBM153219
(US8993756, 18-1)
Show SMILES CCOC(=O)c1c[nH]c2ncnc(-c3cccc(NC(=O)C4(C)CO4)c3)c12
Reactome pathway
US Patent
n/an/a 0.0560n/an/an/an/an/a25
Merck Sharp & Dohme Corp.
US Patent
Assay Description
The ability of compounds to inhibit the activity of JAKl, JAK2, JAK3, and Tyk2 was measured using a recombinant purified GST-tagged catalytic domain ...
US Patent US8993756 (2015)
BindingDB Entry DOI: 10.7270/Q2VQ31DJ