BDBM153315 BPH-789
SMILES: OC(Cc1cccc(c1)-c1cccc(NS(=O)(=O)c2cccc(c2)S(=O)(=O)Nc2cccc(c2)-c2cccc(CC(O)(P(O)(O)=O)P(O)(O)=O)c2)c1)(P(O)(O)=O)P(O)(O)=O
InChI Key: InChIKey=UKSQFLAKPJZXNT-UHFFFAOYSA-N
Data: 2 IC50
PDB links: 1 PDB ID matches this monomer.
Activity Spreadsheet -- Enzyme Inhibition Constant Data from BindingDB
Found 2 hits for monomerid = 153315
Trg + Lig
Ki
nM
ΔG°
kcal/mole
IC50
nM
Kd
nM
EC50/IC50
nM
koff
s-1
kon
M-1s-1
pHTemp
°C
Decaprenyl diphosphate synthase
(Mycobacterium tuberculosis H37Rv)
BDBM153315
(BPH-789)
Show SMILES OC(Cc1cccc(c1)-c1cccc(NS(=O)(=O)c2cccc(c2)S(=O)(=O)Nc2cccc(c2)-c2cccc(CC(O)(P(O)(O)=O)P(O)(O)=O)c2)c1)(P(O)(O)=O)P(O)(O)=O
Show InChI InChI=1S/C34H36N2O18P4S2/c37-33(55(39,40)41,56(42,43)44)21-23-6-1-8-25(16-23)27-10-3-12-29(18-27)35-59(51,52)31-14-5-15-32(20-31)60(53,54)36-30-13-4-11-28(19-30)26-9-2-7-24(17-26)22-34(38,57(45,46)47)58(48,49)50/h1-20,35-38H,21-22H2,(H2,39,40,41)(H2,42,43,44)(H2,45,46,47)(H2,48,49,50)
n/an/a 5.40E+3n/an/an/an/a7.5n/a
University of California San Diego
Assay Description
We screened an in-house library of 53 compounds using trans-FPP as substrate. Briefly, the condensation of IPP and GPP, FPP, or cis-FPP catalyzed by ...
Chem Biol Drug Des 85: 756-69 (2015)
Article DOI: 10.1111/cbdd.12463
BindingDB Entry DOI: 10.7270/Q2ZG6QZN
Decaprenyl diphosphate synthase
(Mycobacterium tuberculosis H37Rv)
BDBM153315
(BPH-789)
Show SMILES OC(Cc1cccc(c1)-c1cccc(NS(=O)(=O)c2cccc(c2)S(=O)(=O)Nc2cccc(c2)-c2cccc(CC(O)(P(O)(O)=O)P(O)(O)=O)c2)c1)(P(O)(O)=O)P(O)(O)=O
Show InChI InChI=1S/C34H36N2O18P4S2/c37-33(55(39,40)41,56(42,43)44)21-23-6-1-8-25(16-23)27-10-3-12-29(18-27)35-59(51,52)31-14-5-15-32(20-31)60(53,54)36-30-13-4-11-28(19-30)26-9-2-7-24(17-26)22-34(38,57(45,46)47)58(48,49)50/h1-20,35-38H,21-22H2,(H2,39,40,41)(H2,42,43,44)(H2,45,46,47)(H2,48,49,50)
n/an/a 360n/an/an/an/a7.5n/a
University of California San Diego
Assay Description
We screened an in-house library of 43 compounds using GPP as substrate. Briefly, the condensation of IPP and GPP, FPP, or cis-FPP catalyzed by DPPS w...
Chem Biol Drug Des 85: 756-69 (2015)
Article DOI: 10.1111/cbdd.12463
BindingDB Entry DOI: 10.7270/Q2ZG6QZN