BDBM153327 BPH-1068
SMILES: OC1CC(O)(CC(OC(=O)\C=C\c2ccc(O)c(O)c2)C1O)C(O)=O
InChI Key: InChIKey=CWVRJTMFETXNAD-DUXPYHPUSA-N
Data: 1 IC50
Activity Spreadsheet -- Enzyme Inhibition Constant Data from BindingDB
Found 1 hit for monomerid = 153327
Trg + Lig
Ki
nM
ΔG°
kcal/mole
IC50
nM
Kd
nM
EC50/IC50
nM
koff
s-1
kon
M-1s-1
pHTemp
°C
cis-Decaprenyl diphosphate synthase (cis-DPPS)
(Mycobacterium tuberculosis H37Rv)
BDBM153327
(BPH-1068)
Show SMILES OC1CC(O)(CC(OC(=O)\C=C\c2ccc(O)c(O)c2)C1O)C(O)=O
Show InChI InChI=1S/C16H18O9/c17-9-3-1-8(5-10(9)18)2-4-13(20)25-12-7-16(24,15(22)23)6-11(19)14(12)21/h1-5,11-12,14,17-19,21,24H,6-7H2,(H,22,23)/b4-2+
n/an/a 2.30E+3n/an/an/an/a7.5n/a
University of California San Diego
Assay Description
We screened an in-house library of 43 compounds using GPP as substrate. Briefly, the condensation of IPP and GPP, FPP, or cis-FPP catalyzed by DPPS w...
Chem Biol Drug Des 85: 756-69 (2015)
Article DOI: 10.1111/cbdd.12463
BindingDB Entry DOI: 10.7270/Q2ZG6QZN